{"text_format":"1","workbook":"xlsx","n_sheets":7,"sheets":["NO_Table Parameter","NO_참조테이블","Secretbook","FabricItem","TanningItem","Paint","SyrupItem"],"not_rendered":{"charts":0,"images":0,"macros":1,"external_links":1,"defined_names":1,"comments":0,"pivot_tables":0},"unopened":[],"bounds":{"document_bytes":16777216,"sheet_cells":100000,"rows_first":2000,"rows_last":500,"rows_between":2000,"halvings":0,"cell_chars":16384,"cell_head_chars":4096},"cells_cut":0,"cells_raw":0,"read":"whole","date_system":"1900"}

{"sheet":"NO_Table Parameter","index":0,"n_rows":50,"n_cols":11,"rows_kept":50,"cut":false,"hidden":false,"merged":[]}
[null,null,null,null,null,null,"[PF_EnumTypeData.xlsm]EMoneyType!Key","[PF_EnumTypeData.xlsm]EMoneyType!Desc",null,"[PF_EnumTypeData.xlsm]EIconTag!Key","[PF_EnumTypeData.xlsm]EIconTag!Desc"]
["GameItemTable",null,null,null,null,null,"열거형 숫자","요약",null,"열거형 숫자","요약"]
["칼럼 한글명","칼럼 영문명","자료형","참조 테이블","설명",null,1,"재화",null,0,"없음"]
["아이템 ID","ItemID","int",null,"아이템 ID 기재",null,2,"스태미너 재화",null,1,"new"]
["아이템 그룹 ID","ItemGroupID","int",null,"아이템 그룹 ID 기재",null,3,"티켓",null,2,"event"]
["아이템 타입","ItemType","int",null,"아이템 타입 기재",null,4,"패키지",null,3,"premium"]
["아이템 레벨","ItemLevel","int",null,"아이템 레벨 기재",null,null,null,null,4,"hot"]
["아이콘 ID","IconID","none",null,"아이콘 ID 기재"]
["Atlas 리소스","AtlasType","int",null,"Atlas 리소스 기재"]
["아이템명","ItemName","string",null,"아이템명 기재"]
["아이템 설명","ItemDescription","string",null,"아이템 설명 기재"]
["재화 종류","BuyPriceType","int",null,"재화 종류 기재"]
["재화 값","BuyPriceValue","int",null,"재화 값 기재"]
["판매 재화","SellPriceType","int",null,"판매 재화 기재"]
["판매 금액","SellPriceValue","int",null,"판매 금액 기재"]
["최대 스택","MaxStack","int",null,"최대 스택 기재"]
["등급","Grade","int",null,"등급 기재"]
["버프","BuffType","int",null,"버프 기재"]
["버프값","BuffValue","int",null,"버프값 기재"]
["리소스 ID","ResID","none",null,"리소스 ID 기재"]
["반전 리소스 ID","RevResId","none",null,"반전 리소스 ID 기재"]
["이펙트 프리팹명","EffectPrefabName","none",null,"이펙트 프리팹명 기재"]
["보유 개수 제한","IsLimit","bool",null,"아이템 최대 보유량 제한 여부"]
["최대 보유량","LimitCount","int",null,"최대 보유량 기재"]
["업그레이드 가능 여부","IsUpgrade","int",null,"업그레이드 가능 여부 기재"]
["판매 가능 여부","IsSell","bool",null,"판매 가능 여부 기재"]
["창고 차지 여부","IsStore","bool",null,"창고 프리 아이템 여부"]
["거래 가능 여부","IsTrade","bool",null,"거래 가능 여부"]
["아이콘 표시","IconTag","bool",null,"표시할 아이콘 종류 기재"]
["NPC 소환 가능 여부","IsSummonNpc","bool",null,"NPC 소환 가능 여부 기재"]
["소환 NPC ID","SummonNpcID","int",null,"소환 NPC ID 기재"]
["제한 개수 보유 오브젝트","LimitShareGrouopID","int",null,"제한 개수 보유 오브젝트 ID 기재"]
["도감 검색 가능 여부","IsBookShow","bool",null,"도감 검색 가능 여부 기재"]
["표시 여부","IsShow","bool",null,"표시 여부 기재"]
["출시 일자","#LiveDate","none",null,"출시 일자 기재"]
["업데이트 버전","#UpdateVersion","none",null,"업데이트 버전 기재"]
["수정 일자","#EditDate","none",null,"수정 일자 기재"]
[]
["MoneyTable"]
["칼럼 한글명","칼럼 영문명","자료형","참조 테이블","설명"]
["아이템 ID","ItemID","int",null,"아이템 ID 기재"]
["아이템명","ItemName","string",null,"아이템명 기재"]
["유료재화 유무","IsRealMoney","bool",null,"유료재화 유무"]
["아이템 타입","ItemType","int",null,"아이템 타입 기재"]
["아이콘 ID","IconID","none",null,"아이콘 ID 기재"]
["Atlas 리소스","AtlasType","int",null,"아틀라스 타입 기재"]
["아이템 쿨타임","ItemCoolTime","int",null,"아이템 쿨타임 기재"]
["출시 일자","#LiveDate","none",null,"출시 일자 기재"]
["업데이트 버전","#UpdateVersion","none",null,"업데이트 버전 기재"]
["수정 일자","#EditDate","none",null,"수정 일자 기재"]

{"sheet":"NO_참조테이블","index":1,"n_rows":227,"n_cols":12,"rows_kept":227,"cut":false,"hidden":false,"merged":[]}
[null,null,null,null,"[PF_ItemData.xlsm]Item!Key","[PF_ItemData.xlsm]Item!#ItemName",null,"[PF_EnumTypeData.xlsm]ERewardType!Key","[PF_EnumTypeData.xlsm]ERewardType!Desc",null,"[PF_EnumTypeData.xlsm]EItemType!Key","[PF_EnumTypeData.xlsm]EItemType!Desc"]
[null,null,null,null,"Key","#ItemName",null,"Key","Desc",null,"Key","Desc"]
[null,null,null,null,"int","none",null,"int","none",null,"int","none"]
[null,null,null,null,"All","Client",null,"All","All",null,"All","All"]
[null,null,null,null,"아이템 ID","아이템명",null,"열거형 숫자","요약",null,"열거형 숫자","요약"]
[null,null,null,null,1,"(임시) 기본 바닥",null,1,"골드",null,1,"가구"]
["※ 데이터 입력 시작하시기 전에 ",null,null,null,2,"브라운 키친 벽 선반",null,2,"무료 주얼",null,2,"음식"]
["꼭 데이터 불러와주세요!",null,null,null,3,"(임시) 카펫",null,3,"유료 주얼",null,3,"탈 것"]
[null,null,null,null,4,"(임시) 테이블",null,4,"주얼",null,4,"파밍 오브젝트"]
["※ 버튼 누른 후 관련 팝업창이 뜰",null,null,null,5,"(임시) 의자",null,5,"하트",null,5,"하우스 프랍"]
["경우, 모두 [X 버튼] 눌러주세요!",null,null,null,6,"(임시) 소품",null,6,"위시",null,6,"화분"]
[null,null,null,null,7,"(임시) 수상 가구",null,7,"패션",null,7,"시럽"]
[null,null,null,null,8,"(임시) 울타리",null,8,"피스",null,8,"비법서"]
[null,null,null,null,9,"(임시) 공중 벽 가구",null,9,"기빙",null,9,"상자"]
[null,null,null,null,10,"(임시) 야외 바닥재",null,10,"경험치",null,10,"드릴"]
[null,null,null,null,11,"(임시) 벽지",null,11,"호감도",null,11,"스티커"]
[null,null,null,null,12,"(임시) 바닥재",null,12,"드릴",null,12,"패브릭 물감"]
[null,null,null,null,13,"(임시) 시럽",null,13,"의상",null,13,"태닝 크림"]
[null,null,null,null,14,"보드라운 복숭아빛 물감",null,14,"스티커",null,14,"파밍 재료"]
[null,null,null,null,15,"시크릿북: 민트 배쓰룸 수건대",null,15,"부동산",null,15,"착용 아이템"]
[null,null,null,null,16,"(임시) 스티커1",null,16,"차량",null,16,"화장"]
[null,null,null,null,17,"옐로우 팝핑 스티커",null,17,"태닝크림",null,17,"지도 아이템"]
[null,null,null,null,18,"(임시) 스티커3",null,18,"패브릭물감",null,18,"페인트"]
[null,null,null,null,19,"(임시) 음식",null,19,"명함테마",null,19,"턱"]
[null,null,null,null,20,"평범한 보상 상자",null,20,"아이템",null,20,"제작 도구"]
[null,null,null,null,21,"일반 드릴",null,21,"현금"]
[null,null,null,null,22,"스페셜 드릴",null,22,"마일리지"]
[null,null,null,null,23,"밭",null,23,"프리미엄 마일리지"]
[null,null,null,null,24,"밀"]
[null,null,null,null,25,"편백나무"]
[null,null,null,null,26,"편백나무 목재"]
[null,null,null,null,27,"감자"]
[null,null,null,null,28,"젖소"]
[null,null,null,null,29,"우유"]
[null,null,null,null,30,"고무나무"]
[null,null,null,null,31,"고무"]
[null,null,null,null,32,"옥수수"]
[null,null,null,null,33,"라임나무"]
[null,null,null,null,34,"라임"]
[null,null,null,null,35,"닭"]
[null,null,null,null,36,"달걀"]
[null,null,null,null,37,"콩"]
[null,null,null,null,38,"닥나무"]
[null,null,null,null,39,"닥나무 목재"]
[null,null,null,null,40,"목화"]
[null,null,null,null,41,"개나리"]
[null,null,null,null,42,"해바라기"]
[null,null,null,null,43,"코스모스"]
[null,null,null,null,44,"포인세티아"]
[null,null,null,null,45,"꿀벌"]
[null,null,null,null,46,"꿀"]
[null,null,null,null,47,"사과나무"]
[null,null,null,null,48,"사과"]
[null,null,null,null,49,"당근"]
[null,null,null,null,50,"양"]
[null,null,null,null,51,"양털"]
[null,null,null,null,52,"야자나무"]
[null,null,null,null,53,"야자"]
[null,null,null,null,54,"마그네슘"]
[null,null,null,null,55,"광천수"]
[null,null,null,null,56,"고구마"]
[null,null,null,null,57,"사슴"]
[null,null,null,null,58,"사슴 뿔"]
[null,null,null,null,59,"석탄"]
[null,null,null,null,60,"단풍나무"]
[null,null,null,null,61,"단풍나무 목재"]
[null,null,null,null,62,"사탕수수"]
[null,null,null,null,63,"자갈"]
[null,null,null,null,64,"흙"]
[null,null,null,null,65,"흰 대리석"]
[null,null,null,null,66,"양파"]
[null,null,null,null,67,"차나무"]
[null,null,null,null,68,"녹차"]
[null,null,null,null,69,"달팽이"]
[null,null,null,null,70,"점액"]
[null,null,null,null,71,"철"]
[null,null,null,null,72,"검은 대리석"]
[null,null,null,null,73,"소나무"]
[null,null,null,null,74,"소나무 목재"]
[null,null,null,null,75,"아보카도 나무"]
[null,null,null,null,76,"아보카도"]
[null,null,null,null,77,"구리"]
[null,null,null,null,78,"토끼"]
[null,null,null,null,79,"토끼털"]
[null,null,null,null,80,"석회석"]
[null,null,null,null,81,"딸기"]
[null,null,null,null,82,"은 덩어리"]
[null,null,null,null,83,"파인애플"]
[null,null,null,null,84,"말"]
[null,null,null,null,85,"말털"]
[null,null,null,null,86,"올리브 나무"]
[null,null,null,null,87,"올리브"]
[null,null,null,null,88,"금 덩어리"]
[null,null,null,null,89,"양상추"]
[null,null,null,null,90,"커피 나무"]
[null,null,null,null,91,"커피"]
[null,null,null,null,92,"아연"]
[null,null,null,null,93,"참나무"]
[null,null,null,null,94,"도토리"]
[null,null,null,null,95,"파피루스"]
[null,null,null,null,96,"바보 거위"]
[null,null,null,null,97,"황금알"]
[null,null,null,null,98,"백금"]
[null,null,null,null,99,"호두나무"]
[null,null,null,null,100,"호두"]
[null,null,null,null,101,"아몬드 나무"]
[null,null,null,null,102,"아몬드"]
[null,null,null,null,103,"빛나는 수정"]
[null,null,null,null,104,"씨앗"]
[null,null,null,null,105,"장미"]
[null,null,null,null,106,"가시 덤불"]
[null,null,null,null,107,"잔가지"]
[null,null,null,null,108,"돌맹이"]
[null,null,null,null,109,"기본 헤어"]
[null,null,null,null,110,"기본 의상"]
[null,null,null,null,111,"채굴 바닥"]
[null,null,null,null,112,"수레"]
[null,null,null,null,113,"황토"]
[null,null,null,null,114,"잡초"]
[null,null,null,null,115,"(임시) 하우스 프랍"]
[null,null,null,null,116,"광산 바위"]
[null,null,null,null,117,"(임시) 태닝 아이템"]
[null,null,null,null,118,"(임시)탑승 아이템"]
[null,null,null,null,119,"시크릿북: 민트 배쓰룸 의자"]
[null,null,null,null,120,"시크릿북: 민트 배쓰룸 파티션"]
[null,null,null,null,121,"시크릿북: 민트 배쓰룸 난로"]
[null,null,null,null,122,"시크릿북: 민트 배쓰룸 발 받침대"]
[null,null,null,null,123,"화이트 서랍장"]
[null,null,null,null,124,"(임시) 지도 아이템1"]
[null,null,null,null,125,"(임시) 지도 아이템2"]
[null,null,null,null,126,"(임시) 지도 아이템3"]
[null,null,null,null,127,"(임시) 스페셜 수상 가구"]
[null,null,null,null,128,"(임시) 스페셜 소품"]
[null,null,null,null,129,"(임시) 스페셜 울타리"]
[null,null,null,null,4038,"초록색 의자"]
[null,null,null,null,4070,"남색 서랍장"]
[null,null,null,null,4218,"밴치"]
[null,null,null,null,4252,"파티션"]
[null,null,null,null,4938,"빨간 소파"]
[null,null,null,null,5666,"딸기 의자"]
[null,null,null,null,130,"(임시) 스티커4"]
[null,null,null,null,131,"(임시) 스티커5"]
[null,null,null,null,132,"(임시) 스티커6"]
[null,null,null,null,133,"라이트 분홍 스티커"]
[null,null,null,null,134,"(임시) 유료 가구"]
[null,null,null,null,135,"(임시) 페인트"]
[null,null,null,null,136,"턱1"]
[null,null,null,null,137,"턱2"]
[null,null,null,null,138,"턱3"]
[null,null,null,null,7639,"(임시) 오리배"]
[null,null,null,null,7670,"(임시) 장난감 배"]
[null,null,null,null,200969,"(임시) 샹들리에"]
[null,null,null,null,201242,"(임시) 구름"]
[null,null,null,null,201436,"(임시) 초승달"]
[null,null,null,null,6056,"스위티 랑데뷰 바 테이블"]
[null,null,null,null,139,"드릴 전용 바위"]
[null,null,null,null,4208,"벽돌 벽지"]
[null,null,null,null,4220,"기본 침대"]
[null,null,null,null,6204,"고급 대리석 바닥재"]
[null,null,null,null,200172,"아카데미 책장"]
[null,null,null,null,200173,"아카데미 분수대"]
[null,null,null,null,200174,"아카데미 테라스"]
[null,null,null,null,200175,"아카데미 창문"]
[null,null,null,null,200188,"아카데미 기둥"]
[null,null,null,null,200192,"아카데미 정문"]
[null,null,null,null,200199,"아카데미 수호 나무"]
[null,null,null,null,200204,"누워 있는 오리 장식"]
[null,null,null,null,200205,"꽃꽃이를 하는 오리"]
[null,null,null,null,200338,"알록달록 벽돌 바닥재"]
[null,null,null,null,200658,"마이멜로디 핑크 커튼 창문"]
[null,null,null,null,200659,"마이멜로디 핑크 침대 "]
[null,null,null,null,200660,"마이멜로디 핑크 옷장"]
[null,null,null,null,200661,"마이멜로디 핑크 카펫"]
[null,null,null,null,200662,"마이멜로디 핑크 액자"]
[null,null,null,null,200663,"마이멜로디 핑크 테이블"]
[null,null,null,null,200664,"마이멜로디 파르페"]
[null,null,null,null,200687,"마이멜로디 딸기 벽지"]
[null,null,null,null,200688,"마이멜로디 하트 바닥재"]
[null,null,null,null,201081,"시나모롤 구름 벽지"]
[null,null,null,null,201082,"시나모롤 스타 바닥재"]
[null,null,null,null,201083,"시나모롤 미니 카펫"]
[null,null,null,null,201084,"시나모롤 세면도구 세트"]
[null,null,null,null,201085,"시나모롤 욕조"]
[null,null,null,null,201086,"시나모롤 미니 배쓰룸"]
[null,null,null,null,201087,"시나모롤 세면대"]
[null,null,null,null,201088,"시나모롤 옷장"]
[null,null,null,null,201089,"시나모롤 휴지 걸이"]
[null,null,null,null,200337,"알록달록 벽돌 벽지"]
[null,null,null,null,201,"주방 조리대"]
[null,null,null,null,202,"원목 작업대"]
[null,null,null,null,203,"금속 가공대"]
[null,null,null,null,204,"재봉틀"]
[null,null,null,null,205,"도자기 돌림판"]
[null,null,null,null,206,"이벤트 제작대"]
[null,null,null,null,140,"파스텔 스카이 블루빛 물감"]
[null,null,null,null,141,"초록빛 12색 랜덤 물감"]
[null,null,null,null,142,"분홍빛 12색 랜덤 물감"]
[null,null,null,null,143,"심플한 티셔츠"]
[null,null,null,null,144,"심플한 롱티셔츠"]
[null,null,null,null,145,"깔끔한 로퍼"]
[null,null,null,null,146,"기본 악세서리"]
[null,null,null,null,147,"(임시) 럭셔리 하우스 프랍"]
[null,null,null,null,148,"베이직 9부 바지"]
[null,null,null,null,149,"베이직 미니스커트"]
[null,null,null,null,150,"태닝 아이템 2"]
[null,null,null,null,151,"태닝 아이템 3"]
[null,null,null,null,1000000,"밤하늘 귀걸이"]
[null,null,null,null,1000001,"밤하늘 요정의 귀"]
[null,null,null,null,1000002,"밤하늘 날개"]
[null,null,null,null,1000003,"밤하늘의 별"]
[null,null,null,null,1000004,"밤하늘 왕관"]
[null,null,null,null,1000005,"밤하늘 뿔"]
[null,null,null,null,1000006,"밤하늘 쵸커"]
[null,null,null,null,1000007,"밤하늘의 달"]
[null,null,null,null,1000008,"밤하늘 미니백"]
[null,null,null,null,1000009,"밤하늘 지팡이"]
[null,null,null,null,1000010,"밤하늘 오른쪽 망토"]
[null,null,null,null,1000011,"밤하늘 왼쪽 망토"]
[null,null,null,null,1000012,"밤하늘 눈물"]
[null,null,null,null,1000013,"밤하늘 체인"]
[null,null,null,null,1000014,"빗질 안 한 짧은 머리"]
[null,null,null,null,1000015,"밤하늘의 꽃잎"]
[null,null,null,null,1000016,"귀여운 얼굴"]
[null,null,null,null,152,"로지 캔디빛 물감"]
[null,null,null,null,153,"트루 퍼플빛 물감"]
[null,null,null,null,154,"봄 내음 진달래빛 물감"]
[null,null,null,null,155,"태닝 아이템 4"]

{"sheet":"Secretbook","index":2,"n_rows":9,"n_cols":7,"rows_kept":9,"cut":false,"hidden":false,"merged":[]}
["ServiceType","Key","#ItemName","CraftingID","OpenTime","#LiveDate","#UpdateVersion"]
["string","int","none","int","datetime","none","none"]
["All","All","Client","All","All","Client","Client"]
["서비스 타입","시크릿북 ID","#아이템명","크래프팅 ID","오픈 시간","출시 일자","업데이트 버전"]
["DEV",15,{"$f":"INDEX(NO_참조테이블!$F:$F,MATCH(Secretbook!B5,NO_참조테이블!$E:$E,0))","v":"시크릿북: 민트 배쓰룸 수건대"},1001,"2023-03-02T05:50:10 +09:00","2022-11-10",0]
["DEV",119,{"$f":"INDEX(NO_참조테이블!$F:$F,MATCH(Secretbook!B6,NO_참조테이블!$E:$E,0))","v":"시크릿북: 민트 배쓰룸 의자"},1002,"2023-03-02T05:50:10 +09:00","2022-11-10",0]
["DEV",120,{"$f":"INDEX(NO_참조테이블!$F:$F,MATCH(Secretbook!B7,NO_참조테이블!$E:$E,0))","v":"시크릿북: 민트 배쓰룸 파티션"},1003,"2023-03-02T05:50:10 +09:00","2022-11-10",0]
["DEV",121,{"$f":"INDEX(NO_참조테이블!$F:$F,MATCH(Secretbook!B8,NO_참조테이블!$E:$E,0))","v":"시크릿북: 민트 배쓰룸 난로"},1004,"2023-03-02T05:50:10 +09:00","2022-11-10",0]
["DEV",122,{"$f":"INDEX(NO_참조테이블!$F:$F,MATCH(Secretbook!B9,NO_참조테이블!$E:$E,0))","v":"시크릿북: 민트 배쓰룸 발 받침대"},1005,"2023-03-02T05:50:10 +09:00","2022-11-10",0]

{"sheet":"FabricItem","index":3,"n_rows":11,"n_cols":10,"rows_kept":11,"cut":false,"hidden":false,"merged":[]}
["ServiceType","Key","#ItemName","GroupID","IsRandom","ColorID","ColorGroupID","OpenTime","#LiveDate","#UpdateVersion"]
["string","int","none","int","bool","int","int","datetime","none","none"]
["All","All","Client","All","All","All","All","All","Client","Client"]
["서비스 타입","패브릭물감 아이템 ID","#아이템명","그룹 ID","랜덤 염색약 여부","컬러 ID","컬러 그룹 ID","오픈 시간","출시 일자","업데이트 버전"]
["DEV",14,{"$f":"INDEX(NO_참조테이블!F:F,MATCH(FabricItem!B5,NO_참조테이블!E:E,0))","v":"보드라운 복숭아빛 물감"},1,0,3,null,"2023-03-02T05:50:10 +09:00","2022-11-10",0]
["DEV",140,{"$f":"INDEX(NO_참조테이블!F:F,MATCH(FabricItem!B6,NO_참조테이블!E:E,0))","v":"파스텔 스카이 블루빛 물감"},1,0,52,null,"2023-03-02T05:50:10 +09:00","2022-11-10",0]
["DEV",152,{"$f":"INDEX(NO_참조테이블!F:F,MATCH(FabricItem!B7,NO_참조테이블!E:E,0))","v":"로지 캔디빛 물감"},1,0,7,null,"2023-03-02T05:50:10 +09:00","2022-11-10",0]
["DEV",153,{"$f":"INDEX(NO_참조테이블!F:F,MATCH(FabricItem!B8,NO_참조테이블!E:E,0))","v":"트루 퍼플빛 물감"},1,0,82,null,"2023-03-02T05:50:10 +09:00","2022-11-10",0]
["DEV",154,{"$f":"INDEX(NO_참조테이블!F:F,MATCH(FabricItem!B9,NO_참조테이블!E:E,0))","v":"봄 내음 진달래빛 물감"},1,0,89,null,"2023-03-02T05:50:10 +09:00","2022-11-10",0]
["DEV",141,{"$f":"INDEX(NO_참조테이블!F:F,MATCH(FabricItem!B10,NO_참조테이블!E:E,0))","v":"초록빛 12색 랜덤 물감"},2,1,null,1,"2023-03-02T05:50:10 +09:00","2022-11-10",0]
["DEV",142,{"$f":"INDEX(NO_참조테이블!F:F,MATCH(FabricItem!B11,NO_참조테이블!E:E,0))","v":"분홍빛 12색 랜덤 물감"},2,1,null,2,"2023-03-02T05:50:10 +09:00","2022-11-10",0]

{"sheet":"TanningItem","index":4,"n_rows":8,"n_cols":8,"rows_kept":8,"cut":false,"hidden":false,"merged":[]}
["ServiceType","Key","#ItemName","SkinColorID","SortIndex","OpenTime","#LiveDate","#UpdateVersion"]
["string","int","none","int","int","datetime","none","none"]
["All","All","Client","All","All","All","Client","Client"]
["서비스 타입","태닝아이템 ID","#아이템명","스킨컬러 ID","정렬 순서","오픈 시간","출시 일자","업데이트 버전"]
["DEV",117,{"$f":"INDEX(NO_참조테이블!$F:$F,MATCH(B5,NO_참조테이블!$E:$E,0))","v":"(임시) 태닝 아이템"},1,1,"2023-03-02T05:50:10 +09:00","2022-11-10",0]
["DEV",150,{"$f":"INDEX(NO_참조테이블!$F:$F,MATCH(B6,NO_참조테이블!$E:$E,0))","v":"태닝 아이템 2"},2,2,"2023-03-02T05:50:10 +09:00","2022-11-10",0]
["DEV",151,{"$f":"INDEX(NO_참조테이블!$F:$F,MATCH(B7,NO_참조테이블!$E:$E,0))","v":"태닝 아이템 3"},3,3,"2023-03-02T05:50:10 +09:00","2022-11-10",0]
["DEV",155,{"$f":"INDEX(NO_참조테이블!$F:$F,MATCH(B8,NO_참조테이블!$E:$E,0))","v":"태닝 아이템 4"},4,4,"2023-03-02T05:50:10 +09:00","2022-11-10",0]

{"sheet":"Paint","index":5,"n_rows":5,"n_cols":10,"rows_kept":5,"cut":false,"hidden":false,"merged":[]}
["ServiceType","Key","#ItemName","ColorID","#PaintPriceType","PaintPriceType","PaintPriceValue","OpenTime","#LiveDate","#UpdateVersion"]
["string","int","none","int","none","ERewardType","int","datetime","none","none"]
["All","All","Client","All","All","All","All","All","Client","Client"]
["서비스 타입","페인트 아이템 ID","#아이템명","컬러 ID","재화 종류","재화 종류","페인트 값","오픈 시간","출시 일자","업데이트 버전"]
["DEV",135,"(임시) 페인트",10,"골드",{"$f":"INDEX(NO_참조테이블!H:H,MATCH(Paint!E5,NO_참조테이블!I:I,0))","v":1},1000,"2023-03-02T05:50:10 +09:00","2022-11-10",0]

{"sheet":"SyrupItem","index":6,"n_rows":5,"n_cols":9,"rows_kept":5,"cut":false,"hidden":false,"merged":[]}
["ServiceType","Key","#ItemName","BuffGroupID","ProgressTime","#ProgressTime","OpenTime","#LiveDate","#UpdateVersion"]
["string","int","none","int","int","time","datetime","none","none"]
["All","All","Client","All","All","All","All","Client","Client"]
["서비스 타입","시럽 아이템 ID","#아이템명","버프 그룹 ID","진행 시간(분)","#진행 시간","오픈 시간","출시 일자","업데이트 버전"]
["DEV",13,{"$f":"INDEX(NO_참조테이블!$F:$F,MATCH(B5,NO_참조테이블!$E:$E,0))","v":"(임시) 시럽"},10,1,{"$f":"E5/(24*60)","v":"00:01:00"},"2023-03-02T05:50:10 +09:00","2022-11-10",0]