{"text_format":"1","workbook":"xlsx","n_sheets":8,"sheets":["NO_Table Parameter","NO_참조테이블","NO_아이템 검색","EquipItem","EquipTabSort","CharacterPartsLimit","Feature","EquipItemString"],"not_rendered":{"charts":0,"images":0,"macros":1,"external_links":1,"defined_names":1,"comments":0,"pivot_tables":0},"unopened":[],"bounds":{"document_bytes":16777216,"sheet_cells":100000,"rows_first":2000,"rows_last":500,"rows_between":2000,"halvings":0,"cell_chars":16384,"cell_head_chars":4096},"cells_cut":0,"cells_raw":0,"read":"whole","date_system":"1900"}

{"sheet":"NO_Table Parameter","index":0,"n_rows":30,"n_cols":20,"rows_kept":30,"cut":false,"hidden":false,"merged":[]}
[null,null,null,null,null,null,"EEquipItemCategory",null,null,"EEquipItemType",null,null,"EPriceType",null,null,"EFeatureType",null,null,"EEquipLimitType"]
[null,null,null,null,null,null,"ID","enum",null,"ID","enum",null,"ID","enum",null,"ID","enum",null,"ID","enum"]
[null,null,null,null,null,null,1,"머리",null,1,"헤어",null,1,"골드",null,1,"격식",null,1,"남녀 공용"]
[null,null,null,null,null,null,2,"얼굴",null,2,"머리 (후드)",null,2,"무료 주얼",null,2,"심플",null,2,"남자만 착용 가능"]
[null,null,null,null,null,null,3,"눈",null,3,"머리 (위)",null,3,"유료 주얼",null,3,"소녀",null,3,"여자만 착용 가능"]
[null,null,null,null,null,null,4,"귀",null,4,"머리 (뒤)",null,4,"주얼",null,4,"시원"]
[null,null,null,null,null,null,5,"목",null,5,"머리 (공중)",null,5,"하트",null,5,"따뜻"]
[null,null,null,null,null,null,6,"몸",null,6,"화장",null,6,"위시",null,6,"큐티"]
[null,null,null,null,null,null,7,"등",null,7,"얼굴 장식",null,7,"패션",null,7,"발랄"]
[null,null,null,null,null,null,8,"어깨",null,8,"피부 장식",null,8,"피스",null,8,"청순"]
{"$rows_left_out":21}
{"sheet":"NO_참조테이블","index":1,"n_rows":514,"n_cols":9,"rows_kept":514,"cut":false,"hidden":false,"merged":[]}
[null,null,null,null,"[PF_ItemData.xlsm]Item!Key","[PF_ItemData.xlsm]Item!ItemNameText",null,"[PF_EnumTypeData.xlsm]EAnimationType!Key","[PF_EnumTypeData.xlsm]EAnimationType!Value"]
[null,null,null,null,"Key","ItemNameText",null,"Key","Value"]
[null,null,null,null,"int","string",null,"int","string"]
[null,null,null,null,"All","All",null,"Client","Client"]
[null,null,null,null,"아이템 ID","아이템명",null,"열거형 숫자","열거형 이름"]
[null,null,null,null,1,"(임시) 기본 바닥",null,0,"None"]
["※ 데이터 입력 시작하시기 전에 ",null,null,null,2,"브라운 키친 벽 선반",null,1,"farm_stand01"]
["꼭 데이터 불러와주세요!",null,null,null,3,"(임시) 카펫",null,2,"farm_stand02"]
[null,null,null,null,4,"(임시) 테이블",null,3,"farm_stand03"]
["※ 버튼 누른 후 관련 팝업창이 뜰",null,null,null,5,"(임시) 의자",null,4,"farm_idle01"]
{"$rows_left_out":505}
{"sheet":"NO_아이템 검색","index":2,"n_rows":23,"n_cols":22,"rows_kept":23,"cut":false,"hidden":false,"merged":[]}
[]
[null,"*속성별 아이템 개수 검색하기",null,null,null,null,null,null,null,null,null,"*현재까지 메인1 속성의 개수"]
[null,null,null,null,null,null,null,null,null,null,null,"속성","격식","심플","섹시","시원","따뜻","큐티","발랄","청순","화려","우아"]
[null,"아이템 종류","메인1","메인2",null,null,null,null,null,"개수",null,"개수",{"$f":"COUNTIF(EquipItem!$S:$S,'NO_아이템 검색'!M3)","v":9},{"$f":"COUNTIF(EquipItem!$S:$S,'NO_아이템 검색'!N3)","v":84},{"$f":"COUNTIF(EquipItem!$S:$S,'NO_아이템 검색'!O3)","v":0},{"$f":"COUNTIF(EquipItem!$S:$S,'NO_아이템 검색'!P3)","v":6},{"$f":"COUNTIF(EquipItem!$S:$S,'NO_아이템 검색'!Q3)","v":0},{"$f":"COUNTIF(EquipItem!$S:$S,'NO_아이템 검색'!R3)","v":16},{"$f":"COUNTIF(EquipItem!$S:$S,'NO_아이템 검색'!S3)","v":5},{"$f":"COUNTIF(EquipItem!$S:$S,'NO_아이템 검색'!T3)","v":0},{"$f":"COUNTIF(EquipItem!$S:$S,'NO_아이템 검색'!U3)","v":3},{"$f":"COUNTIF(EquipItem!$S:$S,'NO_아이템 검색'!V3)","v":0}]
[null,"헤어","격식","발랄",null,null,null,null,null,{"$f":"COUNTIFS(EquipItem!$F:$F,'NO_아이템 검색'!B5,EquipItem!$S:$S,'NO_아이템 검색'!C5,EquipItem!$U:$U,'NO_아이템 검색'!D5)&\"개\"","v":"0개"}]
[]
[null,"아이템 종류","메인1","메인2","서브1",null,null,null,null,"개수"]
[null,"헤어","심플","발랄","심플",null,null,null,null,{"$f":"COUNTIFS(EquipItem!$F:$F,'NO_아이템 검색'!B8,EquipItem!$S:$S,'NO_아이템 검색'!C8,EquipItem!$U:$U,'NO_아이템 검색'!D8,EquipItem!$W:$W,'NO_아이템 검색'!E8)&\"개\"","v":"20개"}]
[]
[null,"아이템 종류","메인1","메인2","서브1","서브2",null,null,null,"개수"]
{"$rows_left_out":14}
{"sheet":"EquipItem","index":3,"n_rows":139,"n_cols":43,"rows_kept":139,"cut":false,"hidden":false,"merged":[]}
["ServiceType","Key","#ItemName","#EquipItemCategory","EquipItemCategory","#EquipItemType","EquipItemType","SkinName","#EquipLimitType","EquipLimitType","IsDye","IsColor1","Color1ID","IsColor2","Color2ID","IsColor3","Color3ID","FabricGroupID","#MainFeature1","MainFeature1","#MainFeature2","MainFeature2","#SubFeature1","SubFeature1","#SubFeature2","SubFeatur2","#SubFeature3","SubFeature3","#SubFeature4","SubFeature4","#SubFeature5","SubFeature5","PartsGroupID","IsFittingRoom","IsDummyEpuip","IsAnim","#AnimName","AnimID","SpecialEffectID_F","SpecialEffectID_B","OpenTime","#LiveDate","UpdateVersion"]
["string","int","none","none","EEquipItemCategory","none","EEquipItemType","string","none","EEquipLimitType","bool","bool","int","bool","int","bool","int","int[]","none","EFeatureType","none","EFeatureType","none","EFeatureType","none","EFeatureType","none","EFeatureType","none","EFeatureType","none","EFeatureType","int","bool","bool","bool","none","EAnimationType","string","string","datetime","none","int"]
["All","All","All","Client","Client","Client","All","Client","Client","Client","Client","All","All","All","All","All","All","All","All","All","All","All","All","All","All","All","All","All","All","All","All","All","All","Client","All","All","Client","Client","Client","Client","All","Client","All"]
["서비스 타입","캐릭터 착용 아이템 ID","캐릭터 착용 아이템명","#아이템 카테고리","아이템 카테고리","#아이템 종류","아이템 종류","스킨네임 ID","#남녀 착용 제한 종류","남녀 착용 제한 종류","염색 가능 여부","파트1 염색 가능 여부","컬러1","파트2 염색 가능 여부","컬러B","파트3 염색 가능 여부","컬러C","물감 그룹 ID","#메인 속성1","메인 속성1","#메인 속성2","메인 속성2","#서브 속성1","서브 속성1","#서브 속성2","서브 속성2","#서브 속성3","서브 속성3","#서브 속성4","서브 속성4","#서브 속성5","서브 속성5","파츠 제한 그룹 ID","피팅룸 추가 여부","마네킹 장착 여부","애니메이션 여부","#애니메이션명","애니메이션 ID","전용 모션 이펙트 F ID","전용 모션 이펙트 B ID","오픈 시간","출시 일자","업데이트 버전"]
["DEV",109,{"$f":"INDEX(NO_참조테이블!$F:$F,MATCH(B5,NO_참조테이블!$E:$E,0))","v":"살짝 뻗친 중단발"},"머리",{"$f":"INDEX('NO_Table Parameter'!$G$3:$G$1048576,MATCH(EquipItem!D5,'NO_Table Parameter'!$H$3:$H$1048576,0))","v":1},"헤어",{"$f":"INDEX('NO_Table Parameter'!$J:$J,MATCH(EquipItem!F5,'NO_Table Parameter'!$K:$K,0))","v":1},"hair_109","남녀 공용",{"$f":"INDEX('NO_Table Parameter'!S:S,MATCH(EquipItem!I5,'NO_Table Parameter'!T:T,0))","v":1},0,1,104,0,null,0,null,null,"심플",{"$f":"INDEX('NO_Table Parameter'!$P:$P,MATCH(S5,'NO_Table Parameter'!$Q:$Q,0))","v":2},"발랄",{"$f":"INDEX('NO_Table Parameter'!$P:$P,MATCH(U5,'NO_Table Parameter'!$Q:$Q,0))","v":7},"심플",{"$f":"INDEX('NO_Table Parameter'!$P:$P,MATCH(W5,'NO_Table Parameter'!$Q:$Q,0))","v":2},"청순",{"$f":"INDEX('NO_Table Parameter'!$P:$P,MATCH(Y5,'NO_Table Parameter'!$Q:$Q,0))","v":8},"발랄",{"$f":"INDEX('NO_Table Parameter'!$P:$P,MATCH(AA5,'NO_Table Parameter'!$Q:$Q,0))","v":7},"시원",{"$f":"INDEX('NO_Table Parameter'!$P:$P,MATCH(AC5,'NO_Table Parameter'!$Q:$Q,0))","v":4},"따뜻",{"$f":"INDEX('NO_Table Parameter'!$P:$P,MATCH(AE5,'NO_Table Parameter'!$Q:$Q,0))","v":5},null,1,1,1,"change_hair01",{"$f":"INDEX(NO_참조테이블!H:H,MATCH(EquipItem!AK5,NO_참조테이블!I:I,0))","v":51},null,null,"2023-03-02T05:50:10 +09:00","2022-09-29",1]
["DEV",110,{"$f":"INDEX(NO_참조테이블!$F:$F,MATCH(B6,NO_참조테이블!$E:$E,0))","v":"기본 의상"},"몸",{"$f":"INDEX('NO_Table Parameter'!$G$3:$G$1048576,MATCH(EquipItem!D6,'NO_Table Parameter'!$H$3:$H$1048576,0))","v":6},"상의",{"$f":"INDEX('NO_Table Parameter'!$J:$J,MATCH(EquipItem!F6,'NO_Table Parameter'!$K:$K,0))","v":15},null,"남녀 공용",{"$f":"INDEX('NO_Table Parameter'!S:S,MATCH(EquipItem!I6,'NO_Table Parameter'!T:T,0))","v":1},1,1,29,1,78,0,null,"1|2","발랄",{"$f":"INDEX('NO_Table Parameter'!$P:$P,MATCH(S6,'NO_Table Parameter'!$Q:$Q,0))","v":7},"시원",{"$f":"INDEX('NO_Table Parameter'!$P:$P,MATCH(U6,'NO_Table Parameter'!$Q:$Q,0))","v":4},"청순",{"$f":"INDEX('NO_Table Parameter'!$P:$P,MATCH(W6,'NO_Table Parameter'!$Q:$Q,0))","v":8},"시원",{"$f":"INDEX('NO_Table Parameter'!$P:$P,MATCH(Y6,'NO_Table Parameter'!$Q:$Q,0))","v":4},"심플",{"$f":"INDEX('NO_Table Parameter'!$P:$P,MATCH(AA6,'NO_Table Parameter'!$Q:$Q,0))","v":2},"큐티",{"$f":"INDEX('NO_Table Parameter'!$P:$P,MATCH(AC6,'NO_Table Parameter'!$Q:$Q,0))","v":6},"따뜻",{"$f":"INDEX('NO_Table Parameter'!$P:$P,MATCH(AE6,'NO_Table Parameter'!$Q:$Q,0))","v":5},null,1,1,1,"change_cloth02",{"$f":"INDEX(NO_참조테이블!H:H,MATCH(EquipItem!AK6,NO_참조테이블!I:I,0))","v":102},null,null,"2023-03-02T05:50:10 +09:00","2022-09-29",1]
["DEV",143,{"$f":"INDEX(NO_참조테이블!$F:$F,MATCH(B7,NO_참조테이블!$E:$E,0))","v":"심플한 티셔츠"},"몸",{"$f":"INDEX('NO_Table Parameter'!$G$3:$G$1048576,MATCH(EquipItem!D7,'NO_Table Parameter'!$H$3:$H$1048576,0))","v":6},"상의",{"$f":"INDEX('NO_Table Parameter'!$J:$J,MATCH(EquipItem!F7,'NO_Table Parameter'!$K:$K,0))","v":15},"top_143","남자만 착용 가능",{"$f":"INDEX('NO_Table Parameter'!S:S,MATCH(EquipItem!I7,'NO_Table Parameter'!T:T,0))","v":2},0,1,98,1,162,0,null,"1|2","격식",{"$f":"INDEX('NO_Table Parameter'!$P:$P,MATCH(S7,'NO_Table Parameter'!$Q:$Q,0))","v":1},"심플",{"$f":"INDEX('NO_Table Parameter'!$P:$P,MATCH(U7,'NO_Table Parameter'!$Q:$Q,0))","v":2},"심플",{"$f":"INDEX('NO_Table Parameter'!$P:$P,MATCH(W7,'NO_Table Parameter'!$Q:$Q,0))","v":2},"청순",{"$f":"INDEX('NO_Table Parameter'!$P:$P,MATCH(Y7,'NO_Table Parameter'!$Q:$Q,0))","v":8},"발랄",{"$f":"INDEX('NO_Table Parameter'!$P:$P,MATCH(AA7,'NO_Table Parameter'!$Q:$Q,0))","v":7},"시원",{"$f":"INDEX('NO_Table Parameter'!$P:$P,MATCH(AC7,'NO_Table Parameter'!$Q:$Q,0))","v":4},"따뜻",{"$f":"INDEX('NO_Table Parameter'!$P:$P,MATCH(AE7,'NO_Table Parameter'!$Q:$Q,0))","v":5},null,1,1,1,"change_cloth02",{"$f":"INDEX(NO_참조테이블!H:H,MATCH(EquipItem!AK7,NO_참조테이블!I:I,0))","v":102},null,null,"2023-03-02T05:50:10 +09:01","2022-09-30",1]
["DEV",144,{"$f":"INDEX(NO_참조테이블!$F:$F,MATCH(B8,NO_참조테이블!$E:$E,0))","v":"심플한 롱티셔츠"},"몸",{"$f":"INDEX('NO_Table Parameter'!$G$3:$G$1048576,MATCH(EquipItem!D8,'NO_Table Parameter'!$H$3:$H$1048576,0))","v":6},"상의",{"$f":"INDEX('NO_Table Parameter'!$J:$J,MATCH(EquipItem!F8,'NO_Table Parameter'!$K:$K,0))","v":15},"top_144","여자만 착용 가능",{"$f":"INDEX('NO_Table Parameter'!S:S,MATCH(EquipItem!I8,'NO_Table Parameter'!T:T,0))","v":3},1,1,160,1,161,0,null,"1|2","소녀",{"$f":"INDEX('NO_Table Parameter'!$P:$P,MATCH(S8,'NO_Table Parameter'!$Q:$Q,0))","v":3},"따뜻",{"$f":"INDEX('NO_Table Parameter'!$P:$P,MATCH(U8,'NO_Table Parameter'!$Q:$Q,0))","v":5},"심플",{"$f":"INDEX('NO_Table Parameter'!$P:$P,MATCH(W8,'NO_Table Parameter'!$Q:$Q,0))","v":2},"화려",{"$f":"INDEX('NO_Table Parameter'!$P:$P,MATCH(Y8,'NO_Table Parameter'!$Q:$Q,0))","v":9},"발랄",{"$f":"INDEX('NO_Table Parameter'!$P:$P,MATCH(AA8,'NO_Table Parameter'!$Q:$Q,0))","v":7},"시원",{"$f":"INDEX('NO_Table Parameter'!$P:$P,MATCH(AC8,'NO_Table Parameter'!$Q:$Q,0))","v":4},"따뜻",{"$f":"INDEX('NO_Table Parameter'!$P:$P,MATCH(AE8,'NO_Table Parameter'!$Q:$Q,0))","v":5},null,0,0,1,"change_cloth02",{"$f":"INDEX(NO_참조테이블!H:H,MATCH(EquipItem!AK8,NO_참조테이블!I:I,0))","v":102},null,null,"2023-03-02T05:50:10 +09:02","2022-10-01",1]
["DEV",145,{"$f":"INDEX(NO_참조테이블!$F:$F,MATCH(B9,NO_참조테이블!$E:$E,0))","v":"깔끔한 로퍼"},"발",{"$f":"INDEX('NO_Table Parameter'!$G$3:$G$1048576,MATCH(EquipItem!D9,'NO_Table Parameter'!$H$3:$H$1048576,0))","v":10},"신발",{"$f":"INDEX('NO_Table Parameter'!$J:$J,MATCH(EquipItem!F9,'NO_Table Parameter'!$K:$K,0))","v":28},"shoes_145","남녀 공용",{"$f":"INDEX('NO_Table Parameter'!S:S,MATCH(EquipItem!I9,'NO_Table Parameter'!T:T,0))","v":1},0,0,null,0,null,0,null,null,"시원",{"$f":"INDEX('NO_Table Parameter'!$P:$P,MATCH(S9,'NO_Table Parameter'!$Q:$Q,0))","v":4},"우아",{"$f":"INDEX('NO_Table Parameter'!$P:$P,MATCH(U9,'NO_Table Parameter'!$Q:$Q,0))","v":10},"발랄",{"$f":"INDEX('NO_Table Parameter'!$P:$P,MATCH(W9,'NO_Table Parameter'!$Q:$Q,0))","v":7},"청순",{"$f":"INDEX('NO_Table Parameter'!$P:$P,MATCH(Y9,'NO_Table Parameter'!$Q:$Q,0))","v":8},"화려",{"$f":"INDEX('NO_Table Parameter'!$P:$P,MATCH(AA9,'NO_Table Parameter'!$Q:$Q,0))","v":9},"시원",{"$f":"INDEX('NO_Table Parameter'!$P:$P,MATCH(AC9,'NO_Table Parameter'!$Q:$Q,0))","v":4},"따뜻",{"$f":"INDEX('NO_Table Parameter'!$P:$P,MATCH(AE9,'NO_Table Parameter'!$Q:$Q,0))","v":5},null,0,0,1,"change_shoes01",{"$f":"INDEX(NO_참조테이블!H:H,MATCH(EquipItem!AK9,NO_참조테이블!I:I,0))","v":54},null,null,"2023-03-02T05:50:10 +09:03","2022-10-02",1]
["DEV",146,{"$f":"INDEX(NO_참조테이블!$F:$F,MATCH(B10,NO_참조테이블!$E:$E,0))","v":"기본 악세서리"},"귀",{"$f":"INDEX('NO_Table Parameter'!$G$3:$G$1048576,MATCH(EquipItem!D10,'NO_Table Parameter'!$H$3:$H$1048576,0))","v":4},"귀걸이",{"$f":"INDEX('NO_Table Parameter'!$J:$J,MATCH(EquipItem!F10,'NO_Table Parameter'!$K:$K,0))","v":14},null,"남녀 공용",{"$f":"INDEX('NO_Table Parameter'!S:S,MATCH(EquipItem!I10,'NO_Table Parameter'!T:T,0))","v":1},0,0,null,0,null,0,null,null,"화려",{"$f":"INDEX('NO_Table Parameter'!$P:$P,MATCH(S10,'NO_Table Parameter'!$Q:$Q,0))","v":9},"청순",{"$f":"INDEX('NO_Table Parameter'!$P:$P,MATCH(U10,'NO_Table Parameter'!$Q:$Q,0))","v":8},"심플",{"$f":"INDEX('NO_Table Parameter'!$P:$P,MATCH(W10,'NO_Table Parameter'!$Q:$Q,0))","v":2},"청순",{"$f":"INDEX('NO_Table Parameter'!$P:$P,MATCH(Y10,'NO_Table Parameter'!$Q:$Q,0))","v":8},"우아",{"$f":"INDEX('NO_Table Parameter'!$P:$P,MATCH(AA10,'NO_Table Parameter'!$Q:$Q,0))","v":10},"격식",{"$f":"INDEX('NO_Table Parameter'!$P:$P,MATCH(AC10,'NO_Table Parameter'!$Q:$Q,0))","v":1},"소녀",{"$f":"INDEX('NO_Table Parameter'!$P:$P,MATCH(AE10,'NO_Table Parameter'!$Q:$Q,0))","v":3},null,0,0,1,"change_eye01",{"$f":"INDEX(NO_참조테이블!H:H,MATCH(EquipItem!AK10,NO_참조테이블!I:I,0))","v":52},null,null,"2023-03-02T05:50:10 +09:04","2022-10-03",1]
{"$rows_left_out":130}
{"sheet":"EquipTabSort","index":4,"n_rows":14,"n_cols":4,"rows_kept":14,"cut":false,"hidden":false,"merged":[]}
["ServiceType","Key","#EquipItemCategory","Sortindex"]
["string","int","none","int"]
["All","All","Client","Client"]
["서비스 타입","아이템 카테고리","#아이템 카테고리","아이템 순서"]
["DEV",{"$f":"INDEX('NO_Table Parameter'!$G:$G,MATCH(C5,'NO_Table Parameter'!$H:$H,0))","v":1},"머리",1]
["DEV",{"$f":"INDEX('NO_Table Parameter'!$G:$G,MATCH(C6,'NO_Table Parameter'!$H:$H,0))","v":2},"얼굴",3]
["DEV",{"$f":"INDEX('NO_Table Parameter'!$G:$G,MATCH(C7,'NO_Table Parameter'!$H:$H,0))","v":3},"눈",4]
["DEV",{"$f":"INDEX('NO_Table Parameter'!$G:$G,MATCH(C8,'NO_Table Parameter'!$H:$H,0))","v":4},"귀",5]
["DEV",{"$f":"INDEX('NO_Table Parameter'!$G:$G,MATCH(C9,'NO_Table Parameter'!$H:$H,0))","v":5},"목",6]
["DEV",{"$f":"INDEX('NO_Table Parameter'!$G:$G,MATCH(C10,'NO_Table Parameter'!$H:$H,0))","v":6},"몸",2]
{"$rows_left_out":5}
{"sheet":"CharacterPartsLimit","index":5,"n_rows":6,"n_cols":5,"rows_kept":6,"cut":false,"hidden":false,"merged":[]}
["ServiceType","Key","PartsGroupID","#PartsName","CharacterPartsType"]
["string","int","int","none","EEquipItemType"]
["All","All","All","Client","All"]
["서비스 타입","파츠 제한 ID","파츠 제한 그룹 ID","파츠명","캐릭터 파츠 종류 ID"]
["DEV",1,1,"하의",{"$f":"INDEX('NO_Table Parameter'!J:J,MATCH(D5,'NO_Table Parameter'!$K:$K,0))","v":16}]
["DEV",2,2,"머리 (후드)",{"$f":"INDEX('NO_Table Parameter'!J:J,MATCH(D6,'NO_Table Parameter'!$K:$K,0))","v":2}]

{"sheet":"Feature","index":6,"n_rows":14,"n_cols":6,"rows_kept":14,"cut":false,"hidden":false,"merged":[]}
["ServiceType","Key","#FeatureName","FeatureName","FeatureColor","#FeatureColor"]
["string","int","none","stringkey","string","none"]
["All","All","Client","All","All","All"]
["서비스 타입","속성 타입 ID","속성명","속성명","속성 컬러 코드","속성 컬러"]
["DEV",{"$f":"INDEX('NO_Table Parameter'!P:P,MATCH(Feature!C5,'NO_Table Parameter'!Q:Q,0))","v":1},"격식",{"$f":"INDEX([1]KOR_StringTable!$B:$B,MATCH(C5,[1]KOR_StringTable!$C:$C,0))","v":"Feature_1"},"#14004E"]
["DEV",{"$f":"INDEX('NO_Table Parameter'!P:P,MATCH(Feature!C6,'NO_Table Parameter'!Q:Q,0))","v":2},"심플",{"$f":"INDEX([1]KOR_StringTable!$B:$B,MATCH(C6,[1]KOR_StringTable!$C:$C,0))","v":"Feature_2"},"#FFFFFF"]
["DEV",{"$f":"INDEX('NO_Table Parameter'!P:P,MATCH(Feature!C7,'NO_Table Parameter'!Q:Q,0))","v":3},"소녀",{"$f":"INDEX([1]KOR_StringTable!$B:$B,MATCH(C7,[1]KOR_StringTable!$C:$C,0))","v":"Feature_3"},"#C00000"]
["DEV",{"$f":"INDEX('NO_Table Parameter'!P:P,MATCH(Feature!C8,'NO_Table Parameter'!Q:Q,0))","v":4},"시원",{"$f":"INDEX([1]KOR_StringTable!$B:$B,MATCH(C8,[1]KOR_StringTable!$C:$C,0))","v":"Feature_4"},"#485BED"]
["DEV",{"$f":"INDEX('NO_Table Parameter'!P:P,MATCH(Feature!C9,'NO_Table Parameter'!Q:Q,0))","v":5},"따뜻",{"$f":"INDEX([1]KOR_StringTable!$B:$B,MATCH(C9,[1]KOR_StringTable!$C:$C,0))","v":"Feature_5"},"#B76A5D"]
["DEV",{"$f":"INDEX('NO_Table Parameter'!P:P,MATCH(Feature!C10,'NO_Table Parameter'!Q:Q,0))","v":6},"큐티",{"$f":"INDEX([1]KOR_StringTable!$B:$B,MATCH(C10,[1]KOR_StringTable!$C:$C,0))","v":"Feature_6"},"#FF84D8"]
{"$rows_left_out":5}
{"sheet":"EquipItemString","index":7,"n_rows":32,"n_cols":5,"rows_kept":32,"cut":false,"hidden":false,"merged":[]}
["ServiceType","Key","#EquipItemType","#EquipItemName","EquipItemName"]
["string","int","none","none","stringkey"]
["All","All","Client","Client","All"]
["서비스 타입","장착 아이템 타입 ID","장착 부위명","장착 부위명","장착 부위명"]
["DEV",1,{"$f":"INDEX('NO_Table Parameter'!K:K,MATCH(EquipItemString!B5,'NO_Table Parameter'!J:J,0))","v":"헤어"},"헤어",{"$f":"INDEX([1]KOR_StringTable!$B:$B,MATCH(D5,[1]KOR_StringTable!$C:$C,0))","v":"EquipItemType_1"}]
["DEV",2,{"$f":"INDEX('NO_Table Parameter'!K:K,MATCH(EquipItemString!B6,'NO_Table Parameter'!J:J,0))","v":"머리 (후드)"},"머리(후드)",{"$f":"INDEX([1]KOR_StringTable!$B:$B,MATCH(D6,[1]KOR_StringTable!$C:$C,0))","v":"EquipItemType_2"}]
["DEV",3,{"$f":"INDEX('NO_Table Parameter'!K:K,MATCH(EquipItemString!B7,'NO_Table Parameter'!J:J,0))","v":"머리 (위)"},"머리(위)",{"$f":"INDEX([1]KOR_StringTable!$B:$B,MATCH(D7,[1]KOR_StringTable!$C:$C,0))","v":"EquipItemType_3"}]
["DEV",4,{"$f":"INDEX('NO_Table Parameter'!K:K,MATCH(EquipItemString!B8,'NO_Table Parameter'!J:J,0))","v":"머리 (뒤)"},"머리(뒤)",{"$f":"INDEX([1]KOR_StringTable!$B:$B,MATCH(D8,[1]KOR_StringTable!$C:$C,0))","v":"EquipItemType_4"}]
["DEV",5,{"$f":"INDEX('NO_Table Parameter'!K:K,MATCH(EquipItemString!B9,'NO_Table Parameter'!J:J,0))","v":"머리 (공중)"},"머리(공중)",{"$f":"INDEX([1]KOR_StringTable!$B:$B,MATCH(D9,[1]KOR_StringTable!$C:$C,0))","v":"EquipItemType_5"}]
["DEV",6,{"$f":"INDEX('NO_Table Parameter'!K:K,MATCH(EquipItemString!B10,'NO_Table Parameter'!J:J,0))","v":"화장"},"얼굴",{"$f":"INDEX([1]KOR_StringTable!$B:$B,MATCH(D10,[1]KOR_StringTable!$C:$C,0))","v":"Makeup"}]
{"$rows_left_out":22}