{"text_format":"1","workbook":"xlsx","n_sheets":6,"sheets":["NO_Table Parameter","Blueprint","Room","Yard","Field","SaveRoom"],"not_rendered":{"charts":0,"images":0,"macros":1,"external_links":2,"defined_names":2,"comments":0,"pivot_tables":0},"unopened":[],"bounds":{"document_bytes":16777216,"sheet_cells":100000,"rows_first":2000,"rows_last":500,"rows_between":2000,"halvings":0,"cell_chars":16384,"cell_head_chars":4096},"cells_cut":0,"cells_raw":0,"read":"whole","date_system":"1900"}

{"sheet":"NO_Table Parameter","index":0,"n_rows":41,"n_cols":14,"rows_kept":41,"cut":false,"hidden":false,"merged":[]}
[null,null,null,null,null,null,null,null,null,null,null,null,"[PF_EnumTypeData.xlsm]EPlaceShortcutType!Key","[PF_EnumTypeData.xlsm]EPlaceShortcutType!Desc"]
["BlueprintTable",null,null,null,null,null,"ERewardType",null,null,"EIconTag",null,null,"열거형 숫자","요약"]
["칼럼 영문명","자료형","칼럼 한글명","참조 테이블","설명",null,"ID","String",null,"ID","enum",null,1,"마이 하우스"]
["Key","int","도면 ID",null,"도면의 고유 주소 기재",null,1,"골드",null,0,"없음",null,2,"마이 빌리지"]
["BlueprintName","stringkey","스트링 코드명",null,"도면명 기재",null,2,"무료 주얼",null,1,"new",null,3,"만남의 공간"]
["IconID","string","아이콘 ID",null,"아이콘 ID 기재",null,3,"유료 주얼",null,2,"evnet",null,4,"특별관"]
["SortIndex","int","순서",null,"팝업창에 보여지는 순서 기재",null,4,"주얼",null,3,"premium"]
["IsSpecial","bool","특별 도면 여부",null,"스테이트별 스페셜 도면 여부",null,5,"하트",null,4,"hot"]
["SpecialFieldType","int","전용 필드 ID",null,"스페셜 도면의 스테이트 기입",null,6,"위시"]
["BuyPriceType","ERewardType","구매재화종류",null,"구매 재화 종류 기입",null,7,"패션"]
["BuyPriceValue","int","구매 값",null,"구매 재화 값 기입",null,8,"피스"]
[null,null,null,null,null,null,9,"기빙"]
["RoomTable",null,null,null,null,null,10,"경험치"]
["칼럼 영문명","자료형","칼럼 한글명","참조 테이블","설명",null,11,"호감도"]
["Key","int","룸 ID",null,"룸의 고유 주소 기재",null,12,"드릴"]
["RoomName","stringkey","스트링 코드명",null,"룸명 기재",null,13,"의상"]
["BlueprintID","int","도면 ID","BlueprintTable","연결된 도면의 ID 기재",null,14,"스티커"]
["IconID","none","아이콘 ID",null,"아이콘 ID 기재",null,15,"부동산"]
["IsBase","bool","기본 룸 여부",null,"처음부터 기본 제공되는 룸 여부",null,16,"차량"]
["OpenSortIndex","int","오픈 순서",null,"오픈 순서 기입",null,17,"태닝크림"]
["OpenGroupID","int","오픈 ID",null,"오픈 조건이 있을 경우 ID 기입",null,18,"패브릭물감"]
[null,null,null,null,null,null,19,"명함테마"]
["YardTable",null,null,null,null,null,20,"아이템"]
["칼럼 영문명","자료형","칼럼 한글명","참조 테이블","설명",null,21,"현금"]
["Key","int","마당 ID",null,"마당 고유 주소 기재",null,22,"마일리지"]
["FieldID","int","구역 ID","FieldTable","해당 마당의 필드 ID 기입",null,23,"프리미엄 마일리지"]
["YardName","stringkey","스트링 코드명",null,"마당명 기재"]
["IconID","none","아이콘 ID",null,"아이콘 ID 기재"]
["OpenSortIndex","int","오픈 순서",null,"오픈 순서 기입"]
["OpenGroupID","int","오픈 ID",null,"오픈 ID 기입"]
[]
["FieldTable"]
["칼럼 영문명","자료형","칼럼 한글명","참조 테이블","설명"]
["Key","int","구역 ID",null,"필드 고유 주소 기재"]
["FieldName","stringkey","스트링 코드명",null,"필드명 기재"]
["IconID","none","아이콘 ID",null,"아이콘 ID 기재"]
["IsSquare","bool","광장 여부",null,"광장일 경우 1 표시"]
["IsHouse","bool","하우스 여부",null,"하우스일 경우 1 표시"]
["BGMPrefabName","none","BGM 프리팹명",null,"BGM 프리팹명 기입"]
["IsShortcut","bool","지도 숏컷 표시 여부",null,"지적도에 숏컷이 있을 경우 1 기입"]
["IconTag","int","숏컷 아이콘 표시",null,"숏컷에 표시될 IconID 기입"]

{"sheet":"Blueprint","index":1,"n_rows":8,"n_cols":13,"rows_kept":8,"cut":false,"hidden":false,"merged":[]}
["ServiceType","Key","#BlueprintName","BlueprintName","IconID","SortIndex","FieldLimitType","#BuyPriceType","BuyPriceType","BuyPriceValue","OpenTime","#LiveDate","#UpdateVersion"]
["string","int","none","stringkey","string","int","int[]","none","ERewardType","int","datetime","none","Client"]
["All","All","Client","Client","Client","Client","Client","All","All","All","All","Client","none"]
["서비스 타입","도면 ID","도면명","스트링 코드명","아이콘 ID","순서","설치 제한 필드 ID","구매재화종류","구매재화종류","구매 값","오픈 시간","출시 일자","업데이트 버전"]
["DEV",1,{"$f":"INDEX([2]KOR_StringTable!$C:$C,MATCH(D5,[2]KOR_StringTable!$B:$B,0))","v":"로열 팰리스"},"Blueprint_1","Blueprint_icon_1",1,{"$f":"IF(ISTEXT(#REF!),LEFT(#REF!,FIND(\":\",#REF!)-1),\"\")","v":""},"주얼",{"$f":"INDEX('NO_Table Parameter'!$G:$G,MATCH(H5,'NO_Table Parameter'!$H:$H,0))","v":4},100,"2023-03-02T05:50:10 +09:00","2022-09-29",0]
["DEV",2,{"$f":"INDEX([2]KOR_StringTable!$C:$C,MATCH(D6,[2]KOR_StringTable!$B:$B,0))","v":"어반 홈스테드"},"Blueprint_2","Blueprint_icon_2",2,null,"주얼",{"$f":"INDEX('NO_Table Parameter'!$G:$G,MATCH(H6,'NO_Table Parameter'!$H:$H,0))","v":4},100,"2023-03-02T05:50:10 +09:00","2022-09-29",0]
["DEV",3,{"$f":"INDEX([2]KOR_StringTable!$C:$C,MATCH(D7,[2]KOR_StringTable!$B:$B,0))","v":"블로썸 코티지"},"Blueprint_3","Blueprint_icon_3",3,null,"주얼",{"$f":"INDEX('NO_Table Parameter'!$G:$G,MATCH(H7,'NO_Table Parameter'!$H:$H,0))","v":4},100,"2023-03-02T05:50:10 +09:00","2022-09-29",0]
["DEV",4,{"$f":"INDEX([2]KOR_StringTable!$C:$C,MATCH(D8,[2]KOR_StringTable!$B:$B,0))","v":"트로피칼 파라다이스"},"Blueprint_4","Blueprint_icon_4",4,null,"주얼",{"$f":"INDEX('NO_Table Parameter'!$G:$G,MATCH(H8,'NO_Table Parameter'!$H:$H,0))","v":4},100,"2023-03-02T05:50:10 +09:00","2022-09-29",0]

{"sheet":"Room","index":2,"n_rows":28,"n_cols":24,"rows_kept":28,"cut":false,"hidden":false,"merged":[]}
["ServiceType","Key","#RoomName","RoomName","BlueprintID","#BlueprintName","IconID","InteriorIconID","IsBase","OpenSortIndex","#BuyPriceType","BuyPriceType","BuyPriceValue","OpenGroupID","WallID","DisappearWallID","FloorID","FieldPrefabName","HouseSkinIconName","RoomConstructionTime","#RoomConstructionTime","OpenTime","#LiveDate","#UpdateVersion"]
["string","int","none","stringkey","int","none","string","string","bool","int","none","ERewardType","int","int","int[]","int[]","int[]","string","string","int","none","datetime","none","Client"]
["All","All","Client","Client","All","Client","Client","Client","Client","Client","All","All","All","All","All","All","All","Client","Client","All","All","All","Client","none"]
["서비스 타입","룸 ID","룸명","스트링 코드명","도면 ID","도면명","룸 아이콘 ID","내부 아이콘 ID","기본 룸 여부","오픈 순서","구매재화종류","구매재화종류","구매 값","오픈 조건 그룹 ID","보유 벽 ID","사라지는 벽 또는 바닥 ID","보유 바닥 ID","프리팹명","하우스 외형 아이콘명","공사 시간 (s)","시분초","오픈 시간","출시 일자","업데이트 버전"]
["DEV",1000,{"$f":"INDEX([2]KOR_StringTable!$C:$C,MATCH(D5,[2]KOR_StringTable!$B:$B,0))","v":"아담한 로열 팰리스"},"Room_1000",1,{"$f":"INDEX(Blueprint!$C:$C,MATCH(E5,Blueprint!$B:$B,0))","v":"로열 팰리스"},"Room_icon_1","1lv-room",1,1,"주얼",{"$f":"INDEX('NO_Table Parameter'!$G:$G,MATCH(K5,'NO_Table Parameter'!$H:$H,0))","v":4},10,52,"1|2|10000",null,"100|10100","Blueprint1_Room1","Blueprint1_Room1_icon",0,{"$f":"T5/(24*60*60)","v":"00:00:00"},"2023-03-02T05:50:10 +09:00","2022-09-29",0]
["DEV",1001,{"$f":"INDEX([2]KOR_StringTable!$C:$C,MATCH(D6,[2]KOR_StringTable!$B:$B,0))","v":"넓어진 로열 팰리스"},"Room_1001",1,{"$f":"INDEX(Blueprint!$C:$C,MATCH(E6,Blueprint!$B:$B,0))","v":"로열 팰리스"},"Room_icon_2","2lv-room",0,2,"주얼",{"$f":"INDEX('NO_Table Parameter'!$G:$G,MATCH(K6,'NO_Table Parameter'!$H:$H,0))","v":4},20,53,"1|2|3|10001","10000|10100","100|101|10101","Blueprint1_Room2","Blueprint1_Room2_icon",24000,"06:40:00","2023-03-02T05:50:10 +09:00","2022-09-29",0]
["DEV",1002,{"$f":"INDEX([2]KOR_StringTable!$C:$C,MATCH(D7,[2]KOR_StringTable!$B:$B,0))","v":"다락이 있는 로열 팰리스"},"Room_1002",1,{"$f":"INDEX(Blueprint!$C:$C,MATCH(E7,Blueprint!$B:$B,0))","v":"로열 팰리스"},"Room_icon_3","3lv-room",0,3,"주얼",{"$f":"INDEX('NO_Table Parameter'!$G:$G,MATCH(K7,'NO_Table Parameter'!$H:$H,0))","v":4},50,54,"1|2|3|4|5|10002","10001|10101","100|101|102|10102","Blueprint1_Room3","Blueprint1_Room3_icon",24000,"06:40:00","2023-03-02T05:50:10 +09:00","2022-09-29",0]
["DEV",1003,{"$f":"INDEX([2]KOR_StringTable!$C:$C,MATCH(D8,[2]KOR_StringTable!$B:$B,0))","v":"발코니가 넓은 로열 팰리스"},"Room_1003",1,{"$f":"INDEX(Blueprint!$C:$C,MATCH(E8,Blueprint!$B:$B,0))","v":"로열 팰리스"},"Room_icon_4","4lv-room",0,4,"주얼",{"$f":"INDEX('NO_Table Parameter'!$G:$G,MATCH(K8,'NO_Table Parameter'!$H:$H,0))","v":4},100,55,"1|2|4|5|6|7|10003","3|10002|10102","100|101|102|103|10103","Blueprint1_Room4","Blueprint1_Room4_icon",24000,"06:40:00","2023-03-02T05:50:10 +09:00","2022-09-29",0]
["DEV",1004,{"$f":"INDEX([2]KOR_StringTable!$C:$C,MATCH(D9,[2]KOR_StringTable!$B:$B,0))","v":"전망 좋은 로열 팰리스"},"Room_1004",1,{"$f":"INDEX(Blueprint!$C:$C,MATCH(E9,Blueprint!$B:$B,0))","v":"로열 팰리스"},"Room_icon_5","5lv-room",0,5,"주얼",{"$f":"INDEX('NO_Table Parameter'!$G:$G,MATCH(K9,'NO_Table Parameter'!$H:$H,0))","v":4},200,56,"1|2|5|6|7|8|9|10004","4|10003|10103","100|101|102|103|104|10104","Blueprint1_Room5","Blueprint1_Room5_icon",24000,"06:40:00","2023-03-02T05:50:10 +09:00","2022-09-29",0]
["DEV",1005,{"$f":"INDEX([2]KOR_StringTable!$C:$C,MATCH(D10,[2]KOR_StringTable!$B:$B,0))","v":"쾌적한 로열 팰리스"},"Room_1005",1,{"$f":"INDEX(Blueprint!$C:$C,MATCH(E10,Blueprint!$B:$B,0))","v":"로열 팰리스"},"Room_icon_6","6lv-room",0,6,"주얼",{"$f":"INDEX('NO_Table Parameter'!$G:$G,MATCH(K10,'NO_Table Parameter'!$H:$H,0))","v":4},500,57,"1|2|5|6|7|8|9|10","10004|10104","100|101|102|103|104|105","Blueprint1_Room6","Blueprint1_Room6_icon",24000,"06:40:00","2023-03-02T05:50:10 +09:00","2022-09-29",0]
["DEV",1006,{"$f":"INDEX([2]KOR_StringTable!$C:$C,MATCH(D11,[2]KOR_StringTable!$B:$B,0))","v":"아담한 어반 홈스테드"},"Room_1006",2,{"$f":"INDEX(Blueprint!$C:$C,MATCH(E11,Blueprint!$B:$B,0))","v":"어반 홈스테드"},"Room_icon_1","7lv-room",1,1,"주얼",{"$f":"INDEX('NO_Table Parameter'!$G:$G,MATCH(K11,'NO_Table Parameter'!$H:$H,0))","v":4},10,52,"1|2|10000",null,"100|10100","Blueprint2_Room1","Blueprint2_Room1_icon",0,"00:00:00","2023-03-02T05:50:10 +09:00","2022-09-29",0]
["DEV",1007,{"$f":"INDEX([2]KOR_StringTable!$C:$C,MATCH(D12,[2]KOR_StringTable!$B:$B,0))","v":"넓어진 어반 홈스테드"},"Room_1007",2,{"$f":"INDEX(Blueprint!$C:$C,MATCH(E12,Blueprint!$B:$B,0))","v":"어반 홈스테드"},"Room_icon_2","8lv-room",0,2,"주얼",{"$f":"INDEX('NO_Table Parameter'!$G:$G,MATCH(K12,'NO_Table Parameter'!$H:$H,0))","v":4},20,53,"1|2|3|10001","10000|10100","100|101|10101","Blueprint2_Room2","Blueprint2_Room2_icon",24000,"06:40:00","2023-03-02T05:50:10 +09:00","2022-09-29",0]
["DEV",1008,{"$f":"INDEX([2]KOR_StringTable!$C:$C,MATCH(D13,[2]KOR_StringTable!$B:$B,0))","v":"다락이 있는 어반 홈스테드"},"Room_1008",2,{"$f":"INDEX(Blueprint!$C:$C,MATCH(E13,Blueprint!$B:$B,0))","v":"어반 홈스테드"},"Room_icon_3","9lv-room",0,3,"주얼",{"$f":"INDEX('NO_Table Parameter'!$G:$G,MATCH(K13,'NO_Table Parameter'!$H:$H,0))","v":4},50,54,"1|2|3|4|5|10002","10001|10101","100|101|102|10102","Blueprint2_Room3","Blueprint2_Room3_icon",24000,"06:40:00","2023-03-02T05:50:10 +09:00","2022-09-29",0]
["DEV",1009,{"$f":"INDEX([2]KOR_StringTable!$C:$C,MATCH(D14,[2]KOR_StringTable!$B:$B,0))","v":"발코니가 넓은 어반 홈 스테드"},"Room_1009",2,{"$f":"INDEX(Blueprint!$C:$C,MATCH(E14,Blueprint!$B:$B,0))","v":"어반 홈스테드"},"Room_icon_4","10lv-room",0,4,"주얼",{"$f":"INDEX('NO_Table Parameter'!$G:$G,MATCH(K14,'NO_Table Parameter'!$H:$H,0))","v":4},100,55,"1|2|4|5|6|7|10003","3|10002|10102","100|101|102|103|10103","Blueprint2_Room4","Blueprint2_Room4_icon",24000,"06:40:00","2023-03-02T05:50:10 +09:00","2022-09-29",0]
["DEV",1010,{"$f":"INDEX([2]KOR_StringTable!$C:$C,MATCH(D15,[2]KOR_StringTable!$B:$B,0))","v":"전망 좋은 어반 홈 스테드"},"Room_1010",2,{"$f":"INDEX(Blueprint!$C:$C,MATCH(E15,Blueprint!$B:$B,0))","v":"어반 홈스테드"},"Room_icon_5","11lv-room",0,5,"주얼",{"$f":"INDEX('NO_Table Parameter'!$G:$G,MATCH(K15,'NO_Table Parameter'!$H:$H,0))","v":4},200,56,"1|2|5|6|7|8|9|10004","4|10003|10103","100|101|102|103|104|10104","Blueprint2_Room5","Blueprint2_Room5_icon",24000,"06:40:00","2023-03-02T05:50:10 +09:00","2022-09-29",0]
["DEV",1011,{"$f":"INDEX([2]KOR_StringTable!$C:$C,MATCH(D16,[2]KOR_StringTable!$B:$B,0))","v":"쾌적한 어반 홈 스테드"},"Room_1011",2,{"$f":"INDEX(Blueprint!$C:$C,MATCH(E16,Blueprint!$B:$B,0))","v":"어반 홈스테드"},"Room_icon_6","12lv-room",0,6,"주얼",{"$f":"INDEX('NO_Table Parameter'!$G:$G,MATCH(K16,'NO_Table Parameter'!$H:$H,0))","v":4},500,57,"1|2|5|6|7|8|9|10","10004|10104","100|101|102|103|104|105","Blueprint2_Room6","Blueprint2_Room6_icon",24000,"06:40:00","2023-03-02T05:50:10 +09:00","2022-09-29",0]
["DEV",1012,{"$f":"INDEX([2]KOR_StringTable!$C:$C,MATCH(D17,[2]KOR_StringTable!$B:$B,0))","v":"아담한 블로썸 코티지"},"Room_1012",3,{"$f":"INDEX(Blueprint!$C:$C,MATCH(E17,Blueprint!$B:$B,0))","v":"블로썸 코티지"},"Room_icon_1","13lv-room",1,1,"주얼",{"$f":"INDEX('NO_Table Parameter'!$G:$G,MATCH(K17,'NO_Table Parameter'!$H:$H,0))","v":4},10,52,"1|2|10000",null,"100|10100","Blueprint3_Room1","Blueprint3_Room1_icon",0,"00:00:00","2023-03-02T05:50:10 +09:00","2022-09-29",0]
["DEV",1013,{"$f":"INDEX([2]KOR_StringTable!$C:$C,MATCH(D18,[2]KOR_StringTable!$B:$B,0))","v":"넓어진 블로썸 코티지"},"Room_1013",3,{"$f":"INDEX(Blueprint!$C:$C,MATCH(E18,Blueprint!$B:$B,0))","v":"블로썸 코티지"},"Room_icon_2","14lv-room",0,2,"주얼",{"$f":"INDEX('NO_Table Parameter'!$G:$G,MATCH(K18,'NO_Table Parameter'!$H:$H,0))","v":4},20,53,"1|2|3|10001","10000|10100","100|101|10101","Blueprint3_Room2","Blueprint3_Room2_icon",24000,"06:40:00","2023-03-02T05:50:10 +09:00","2022-09-29",0]
["DEV",1014,{"$f":"INDEX([2]KOR_StringTable!$C:$C,MATCH(D19,[2]KOR_StringTable!$B:$B,0))","v":"다락이 있는 블로썸 코티지"},"Room_1014",3,{"$f":"INDEX(Blueprint!$C:$C,MATCH(E19,Blueprint!$B:$B,0))","v":"블로썸 코티지"},"Room_icon_3","15lv-room",0,3,"주얼",{"$f":"INDEX('NO_Table Parameter'!$G:$G,MATCH(K19,'NO_Table Parameter'!$H:$H,0))","v":4},50,54,"1|2|3|4|5|10002","10001|10101","100|101|102|10102","Blueprint3_Room3","Blueprint3_Room3_icon",24000,"06:40:00","2023-03-02T05:50:10 +09:00","2022-09-29",0]
["DEV",1015,{"$f":"INDEX([2]KOR_StringTable!$C:$C,MATCH(D20,[2]KOR_StringTable!$B:$B,0))","v":"발코니가 넓은 블로썸 코티지"},"Room_1015",3,{"$f":"INDEX(Blueprint!$C:$C,MATCH(E20,Blueprint!$B:$B,0))","v":"블로썸 코티지"},"Room_icon_4","16lv-room",0,4,"주얼",{"$f":"INDEX('NO_Table Parameter'!$G:$G,MATCH(K20,'NO_Table Parameter'!$H:$H,0))","v":4},100,55,"1|2|4|5|6|7|10003","3|10002|10102","100|101|102|103|10103","Blueprint3_Room4","Blueprint3_Room4_icon",24000,"06:40:00","2023-03-02T05:50:10 +09:00","2022-09-29",0]
["DEV",1016,{"$f":"INDEX([2]KOR_StringTable!$C:$C,MATCH(D21,[2]KOR_StringTable!$B:$B,0))","v":"전망 좋은 블로썸 코티지"},"Room_1016",3,{"$f":"INDEX(Blueprint!$C:$C,MATCH(E21,Blueprint!$B:$B,0))","v":"블로썸 코티지"},"Room_icon_5","17lv-room",0,5,"주얼",{"$f":"INDEX('NO_Table Parameter'!$G:$G,MATCH(K21,'NO_Table Parameter'!$H:$H,0))","v":4},200,56,"1|2|5|6|7|8|9|10004","4|10003|10103","100|101|102|103|104|10104","Blueprint3_Room5","Blueprint3_Room5_icon",24000,"06:40:00","2023-03-02T05:50:10 +09:00","2022-09-29",0]
["DEV",1017,{"$f":"INDEX([2]KOR_StringTable!$C:$C,MATCH(D22,[2]KOR_StringTable!$B:$B,0))","v":"쾌적한 블로썸 코티지"},"Room_1017",3,{"$f":"INDEX(Blueprint!$C:$C,MATCH(E22,Blueprint!$B:$B,0))","v":"블로썸 코티지"},"Room_icon_6","18lv-room",0,6,"주얼",{"$f":"INDEX('NO_Table Parameter'!$G:$G,MATCH(K22,'NO_Table Parameter'!$H:$H,0))","v":4},500,57,"1|2|5|6|7|8|9|10","10004|10104","100|101|102|103|104|105","Blueprint3_Room6","Blueprint3_Room6_icon",24000,"06:40:00","2023-03-02T05:50:10 +09:00","2022-09-29",0]
["DEV",1018,{"$f":"INDEX([2]KOR_StringTable!$C:$C,MATCH(D23,[2]KOR_StringTable!$B:$B,0))","v":"아담한 트로피칼 파라다이스"},"Room_1018",4,{"$f":"INDEX(Blueprint!$C:$C,MATCH(E23,Blueprint!$B:$B,0))","v":"트로피칼 파라다이스"},"Room_icon_1","19lv-room",1,1,"주얼",{"$f":"INDEX('NO_Table Parameter'!$G:$G,MATCH(K23,'NO_Table Parameter'!$H:$H,0))","v":4},10,52,"1|2|10000",null,"100|10100","Blueprint4_Room1","Blueprint4_Room1_icon",0,"00:00:00","2023-03-02T05:50:10 +09:00","2022-09-29",0]
["DEV",1019,{"$f":"INDEX([2]KOR_StringTable!$C:$C,MATCH(D24,[2]KOR_StringTable!$B:$B,0))","v":"넓어진 트로피칼 파라다이스"},"Room_1019",4,{"$f":"INDEX(Blueprint!$C:$C,MATCH(E24,Blueprint!$B:$B,0))","v":"트로피칼 파라다이스"},"Room_icon_2","20lv-room",0,2,"주얼",{"$f":"INDEX('NO_Table Parameter'!$G:$G,MATCH(K24,'NO_Table Parameter'!$H:$H,0))","v":4},20,53,"1|2|3|10001","10000|10100","100|101|10101","Blueprint4_Room2","Blueprint4_Room2_icon",24000,"06:40:00","2023-03-02T05:50:10 +09:00","2022-09-29",0]
["DEV",1020,{"$f":"INDEX([2]KOR_StringTable!$C:$C,MATCH(D25,[2]KOR_StringTable!$B:$B,0))","v":"다락이 있는 트로피칼 파라다이스"},"Room_1020",4,{"$f":"INDEX(Blueprint!$C:$C,MATCH(E25,Blueprint!$B:$B,0))","v":"트로피칼 파라다이스"},"Room_icon_3","21lv-room",0,3,"주얼",{"$f":"INDEX('NO_Table Parameter'!$G:$G,MATCH(K25,'NO_Table Parameter'!$H:$H,0))","v":4},50,54,"1|2|3|4|5|10002","10001|10101","100|101|102|10102","Blueprint4_Room3","Blueprint4_Room3_icon",24000,"06:40:00","2023-03-02T05:50:10 +09:00","2022-09-29",0]
["DEV",1021,{"$f":"INDEX([2]KOR_StringTable!$C:$C,MATCH(D26,[2]KOR_StringTable!$B:$B,0))","v":"발코니가 넓은 로열 팰리스"},"Room_1003",4,{"$f":"INDEX(Blueprint!$C:$C,MATCH(E26,Blueprint!$B:$B,0))","v":"트로피칼 파라다이스"},"Room_icon_4","22lv-room",0,4,"주얼",{"$f":"INDEX('NO_Table Parameter'!$G:$G,MATCH(K26,'NO_Table Parameter'!$H:$H,0))","v":4},100,55,"1|2|4|5|6|7|10003","3|10002|10102","100|101|102|103|10103","Blueprint4_Room4","Blueprint4_Room4_icon",24000,"06:40:00","2023-03-02T05:50:10 +09:00","2022-09-29",0]
["DEV",1022,{"$f":"INDEX([2]KOR_StringTable!$C:$C,MATCH(D27,[2]KOR_StringTable!$B:$B,0))","v":"전망 좋은 로열 팰리스"},"Room_1004",4,{"$f":"INDEX(Blueprint!$C:$C,MATCH(E27,Blueprint!$B:$B,0))","v":"트로피칼 파라다이스"},"Room_icon_5","23lv-room",0,5,"주얼",{"$f":"INDEX('NO_Table Parameter'!$G:$G,MATCH(K27,'NO_Table Parameter'!$H:$H,0))","v":4},200,56,"1|2|5|6|7|8|9|10004","4|10003|10103","100|101|102|103|104|10104","Blueprint4_Room5","Blueprint4_Room5_icon",24000,"06:40:00","2023-03-02T05:50:10 +09:00","2022-09-29",0]
["DEV",1023,{"$f":"INDEX([2]KOR_StringTable!$C:$C,MATCH(D28,[2]KOR_StringTable!$B:$B,0))","v":"쾌적한 로열 팰리스"},"Room_1005",4,{"$f":"INDEX(Blueprint!$C:$C,MATCH(E28,Blueprint!$B:$B,0))","v":"트로피칼 파라다이스"},"Room_icon_6","24lv-room",0,6,"주얼",{"$f":"INDEX('NO_Table Parameter'!$G:$G,MATCH(K28,'NO_Table Parameter'!$H:$H,0))","v":4},500,57,"1|2|5|6|7|8|9|10","10004|10104","100|101|102|103|104|105","Blueprint4_Room6","Blueprint4_Room6_icon",24000,"06:40:00","2023-03-02T05:50:10 +09:00","2022-09-29",0]

{"sheet":"Yard","index":3,"n_rows":120,"n_cols":13,"rows_kept":120,"cut":false,"hidden":false,"merged":[]}
["ServiceType","Key","FieldID","#YardName","YardName","IconID","IsBase","OpenSortIndex","OpenGroupID","ConsumeMatGroupID","OpenTime","#LiveDate","#UpdateVersion"]
["string","int","int","none","stringkey","string","bool","int","int","int","datetime","none","Client"]
["All","All","All","Client","Client","Client","Client","Client","All","All","All","Client","none"]
["서비스 타입","마당 ID","구역 ID","마당명","스트링 코드명","아이콘 ID","기본 마당 여부","오픈 순서","오픈 ID","소모 재료 그룹 ID","오픈 시간","출시 일자","업데이트 버전"]
["DEV",1000000,101,{"$f":"INDEX([2]KOR_StringTable!$C:$C,MATCH(E5,[2]KOR_StringTable!$B:$B,0))","v":"로열 팰리스의 작은 가든"},"Yard_1000000","Yard_icon_1",0,1,22,10,"2023-03-02T05:50:10 +09:00","2022-09-29"]
["DEV",1000001,101,{"$f":"INDEX([2]KOR_StringTable!$C:$C,MATCH(E6,[2]KOR_StringTable!$B:$B,0))","v":"로열 팰리스의 옆뜰"},"Yard_1000001","Yard_icon_1",0,2,22,10,"2023-03-02T05:50:10 +09:00","2022-09-29"]
["DEV",1000002,101,{"$f":"INDEX([2]KOR_StringTable!$C:$C,MATCH(E7,[2]KOR_StringTable!$B:$B,0))","v":"로열 팰리스의 파티오"},"Yard_1000002","Yard_icon_1",0,3,22,10,"2023-03-02T05:50:10 +09:00","2022-09-29"]
["DEV",1000003,101,{"$f":"INDEX([2]KOR_StringTable!$C:$C,MATCH(E8,[2]KOR_StringTable!$B:$B,0))","v":"로열 팰리스의 쾌적한 가든"},"Yard_1000003","Yard_icon_1",0,4,22,10,"2023-03-02T05:50:10 +09:00","2022-09-29"]
["DEV",1000004,101,{"$f":"INDEX([2]KOR_StringTable!$C:$C,MATCH(E9,[2]KOR_StringTable!$B:$B,0))","v":"로열 팰리스의 전망 좋은 정원"},"Yard_1000004","Yard_icon_2",0,5,22,10,"2023-03-02T05:50:10 +09:00","2022-09-29"]
["DEV",1000006,101,{"$f":"INDEX([2]KOR_StringTable!$C:$C,MATCH(E10,[2]KOR_StringTable!$B:$B,0))","v":"로열 팰리스의 뒷뜰"},"Yard_1000005","Yard_icon_2",0,6,22,10,"2023-03-02T05:50:10 +09:00","2022-09-29"]
["DEV",1000007,101,{"$f":"INDEX([2]KOR_StringTable!$C:$C,MATCH(E11,[2]KOR_StringTable!$B:$B,0))","v":"로열 팰리스의 시크릿 가든"},"Yard_1000006","Yard_icon_3",0,7,22,10,"2023-03-02T05:50:10 +09:00","2022-09-29"]
["DEV",1000008,101,{"$f":"INDEX([2]KOR_StringTable!$C:$C,MATCH(E12,[2]KOR_StringTable!$B:$B,0))","v":"로열 팰리스의 잔디밭"},"Yard_1000007","Yard_icon_3",0,8,22,10,"2023-03-02T05:50:10 +09:00","2022-09-29"]
["DEV",1000009,101,{"$f":"INDEX([2]KOR_StringTable!$C:$C,MATCH(E13,[2]KOR_StringTable!$B:$B,0))","v":"로열 팰리스의 뒤뜰"},"Yard_1000008","Yard_icon_2",0,9,22,10,"2023-03-02T05:50:10 +09:00","2022-09-29"]
["DEV",1000010,101,{"$f":"INDEX([2]KOR_StringTable!$C:$C,MATCH(E14,[2]KOR_StringTable!$B:$B,0))","v":"로열 팰리스 코트야드"},"Yard_1000009","Yard_icon_2",0,10,22,10,"2023-03-02T05:50:10 +09:00","2022-09-29"]
["DEV",1000011,103,{"$f":"INDEX([2]KOR_StringTable!$C:$C,MATCH(E15,[2]KOR_StringTable!$B:$B,0))","v":"어반 홈스테드의 작은 앞뜰"},"Yard_1000010","Yard_icon_3",0,1,22,10,"2023-03-02T05:50:10 +09:00","2022-09-29"]
["DEV",1000012,103,{"$f":"INDEX([2]KOR_StringTable!$C:$C,MATCH(E16,[2]KOR_StringTable!$B:$B,0))","v":"어반 홈스테드의 넓은 야드"},"Yard_1000011","Yard_icon_5",0,2,22,10,"2023-03-02T05:50:10 +09:00","2022-09-29"]
["DEV",1000013,103,{"$f":"INDEX([2]KOR_StringTable!$C:$C,MATCH(E17,[2]KOR_StringTable!$B:$B,0))","v":"어반 홈스테드의 풀장 가든"},"Yard_1000012","Yard_icon_3",0,3,22,10,"2023-03-02T05:50:10 +09:00","2022-09-29"]
["DEV",1000014,103,{"$f":"INDEX([2]KOR_StringTable!$C:$C,MATCH(E18,[2]KOR_StringTable!$B:$B,0))","v":"어반 홈스테드의 파티오"},"Yard_1000013","Yard_icon_3",0,4,22,10,"2023-03-02T05:50:10 +09:00","2022-09-29"]
["DEV",1000015,103,{"$f":"INDEX([2]KOR_StringTable!$C:$C,MATCH(E19,[2]KOR_StringTable!$B:$B,0))","v":"어반 홈스테드의 전망 좋은 야외 공간"},"Yard_1000014","Yard_icon_3",0,5,22,10,"2023-03-02T05:50:10 +09:00","2022-09-29"]
["DEV",1000016,103,{"$f":"INDEX([2]KOR_StringTable!$C:$C,MATCH(E20,[2]KOR_StringTable!$B:$B,0))","v":"어반 홈스테드의 뒷뜰"},"Yard_1000015","Yard_icon_3",0,6,22,10,"2023-03-02T05:50:10 +09:00","2022-09-29"]
["DEV",1000017,103,{"$f":"INDEX([2]KOR_StringTable!$C:$C,MATCH(E21,[2]KOR_StringTable!$B:$B,0))","v":"어반 홈스테드의 넓어진 뜰"},"Yard_1000016","Yard_icon_4",0,7,22,10,"2023-03-02T05:50:10 +09:00","2022-09-29"]
["DEV",1000018,103,{"$f":"INDEX([2]KOR_StringTable!$C:$C,MATCH(E22,[2]KOR_StringTable!$B:$B,0))","v":"어반 홈스테드의 쾌적한 정원"},"Yard_1000017","Yard_icon_3",0,8,22,10,"2023-03-02T05:50:10 +09:00","2022-09-29"]
["DEV",1000019,103,{"$f":"INDEX([2]KOR_StringTable!$C:$C,MATCH(E23,[2]KOR_StringTable!$B:$B,0))","v":"어반 홈스테드의 시크릿 가든"},"Yard_1000018","Yard_icon_3",0,9,22,10,"2023-03-02T05:50:10 +09:00","2022-09-29"]
["DEV",1000020,103,{"$f":"INDEX([2]KOR_StringTable!$C:$C,MATCH(E24,[2]KOR_StringTable!$B:$B,0))","v":"어반 홈스테드의 코트야드"},"Yard_1000019","Yard_icon_3",0,10,22,10,"2023-03-02T05:50:10 +09:00","2022-09-29"]
["DEV",1000021,102,{"$f":"INDEX([2]KOR_StringTable!$C:$C,MATCH(E25,[2]KOR_StringTable!$B:$B,0))","v":"블로썸 코티지의 작은 가든"},"Yard_1000020","Yard_icon_3",0,1,22,10,"2023-03-02T05:50:10 +09:00","2022-09-29"]
["DEV",1000022,102,{"$f":"INDEX([2]KOR_StringTable!$C:$C,MATCH(E26,[2]KOR_StringTable!$B:$B,0))","v":"블로섬 코티지의 옆뜰"},"Yard_1000021","Yard_icon_5",0,2,22,10,"2023-03-02T05:50:10 +09:00","2022-09-29"]
["DEV",1000023,102,{"$f":"INDEX([2]KOR_StringTable!$C:$C,MATCH(E27,[2]KOR_StringTable!$B:$B,0))","v":"블로썸 코티지의 파티오"},"Yard_1000022","Yard_icon_3",0,3,22,10,"2023-03-02T05:50:10 +09:00","2022-09-29"]
["DEV",1000024,102,{"$f":"INDEX([2]KOR_StringTable!$C:$C,MATCH(E28,[2]KOR_StringTable!$B:$B,0))","v":"블로썸 코티지의 시크릿 가든"},"Yard_1000023","Yard_icon_3",0,4,22,10,"2023-03-02T05:50:10 +09:00","2022-09-29"]
["DEV",1000025,102,{"$f":"INDEX([2]KOR_StringTable!$C:$C,MATCH(E29,[2]KOR_StringTable!$B:$B,0))","v":"블로썸 코티지의 넓어진 가든"},"Yard_1000024","Yard_icon_3",0,5,22,10,"2023-03-02T05:50:10 +09:00","2022-09-29"]
["DEV",1000026,102,{"$f":"INDEX([2]KOR_StringTable!$C:$C,MATCH(E30,[2]KOR_StringTable!$B:$B,0))","v":"블로썸 코티지의 뒷뜰"},"Yard_1000025","Yard_icon_3",0,6,22,10,"2023-03-02T05:50:10 +09:00","2022-09-29"]
["DEV",1000027,102,{"$f":"INDEX([2]KOR_StringTable!$C:$C,MATCH(E31,[2]KOR_StringTable!$B:$B,0))","v":"블로썸 코티지의 숨겨진 숲"},"Yard_1000026","Yard_icon_4",0,7,22,10,"2023-03-02T05:50:10 +09:00","2022-09-29"]
["DEV",1000028,102,{"$f":"INDEX([2]KOR_StringTable!$C:$C,MATCH(E32,[2]KOR_StringTable!$B:$B,0))","v":"블로썸 코티지의 잔디밭"},"Yard_1000027","Yard_icon_3",0,8,22,10,"2023-03-02T05:50:10 +09:00","2022-09-29"]
["DEV",1000029,102,{"$f":"INDEX([2]KOR_StringTable!$C:$C,MATCH(E33,[2]KOR_StringTable!$B:$B,0))","v":"블로썸 코티지의 전망 좋은 가든"},"Yard_1000028","Yard_icon_3",0,9,22,10,"2023-03-02T05:50:10 +09:00","2022-09-29"]
["DEV",1000030,102,{"$f":"INDEX([2]KOR_StringTable!$C:$C,MATCH(E34,[2]KOR_StringTable!$B:$B,0))","v":"블로썸 코티지의 코트야드"},"Yard_1000029","Yard_icon_3",0,10,22,10,"2023-03-02T05:50:10 +09:00","2022-09-29"]
["DEV",1000031,104,{"$f":"INDEX([2]KOR_StringTable!$C:$C,MATCH(E35,[2]KOR_StringTable!$B:$B,0))","v":"나의 작은 가든"},"GreenFarm_Yard_0","Yard_icon_1",1,1,22,10,"2023-03-02T05:50:10 +09:00","2022-09-29"]
["DEV",1000032,104,{"$f":"INDEX([2]KOR_StringTable!$C:$C,MATCH(E36,[2]KOR_StringTable!$B:$B,0))","v":"비밀스러운 동굴"},"GreenFarm_Yard_1","Yard_icon_1",0,2,22,10,"2023-03-02T05:50:10 +09:00","2022-09-29"]
["DEV",1000033,104,{"$f":"INDEX([2]KOR_StringTable!$C:$C,MATCH(E37,[2]KOR_StringTable!$B:$B,0))","v":"햇살 머무는 뜰"},"GreenFarm_Yard_2","Yard_icon_1",0,3,22,10,"2023-03-02T05:50:10 +09:00","2022-09-29"]
["DEV",1000034,104,{"$f":"INDEX([2]KOR_StringTable!$C:$C,MATCH(E38,[2]KOR_StringTable!$B:$B,0))","v":"고요한 숲길"},"GreenFarm_Yard_3","Yard_icon_1",0,4,22,10,"2023-03-02T05:50:10 +09:00","2022-09-29"]
["DEV",1000035,104,{"$f":"INDEX([2]KOR_StringTable!$C:$C,MATCH(E39,[2]KOR_StringTable!$B:$B,0))","v":"추억의 연못"},"GreenFarm_Yard_4","Yard_icon_1",0,5,22,10,"2023-03-02T05:50:10 +09:00","2022-09-29"]
["DEV",1000036,104,{"$f":"INDEX([2]KOR_StringTable!$C:$C,MATCH(E40,[2]KOR_StringTable!$B:$B,0))","v":"물소리 머무는 곳"},"GreenFarm_Yard_5","Yard_icon_2",0,6,22,10,"2023-03-02T05:50:10 +09:00","2022-09-29"]
["DEV",1000037,104,{"$f":"INDEX([2]KOR_StringTable!$C:$C,MATCH(E41,[2]KOR_StringTable!$B:$B,0))","v":"새벽 이슬 정원"},"GreenFarm_Yard_6","Yard_icon_2",0,7,22,10,"2023-03-02T05:50:10 +09:00","2022-09-29"]
["DEV",1000038,104,{"$f":"INDEX([2]KOR_StringTable!$C:$C,MATCH(E42,[2]KOR_StringTable!$B:$B,0))","v":"꽃비 내리는 자리"},"GreenFarm_Yard_7","Yard_icon_3",0,8,22,10,"2023-03-02T05:50:10 +09:00","2022-09-29"]
["DEV",1000039,104,{"$f":"INDEX([2]KOR_StringTable!$C:$C,MATCH(E43,[2]KOR_StringTable!$B:$B,0))","v":"달빛 정원"},"GreenFarm_Yard_8","Yard_icon_3",0,9,22,10,"2023-03-02T05:50:10 +09:00","2022-09-29"]
["DEV",1000040,104,{"$f":"INDEX([2]KOR_StringTable!$C:$C,MATCH(E44,[2]KOR_StringTable!$B:$B,0))","v":"반딧불 정원"},"GreenFarm_Yard_9","Yard_icon_2",0,10,22,10,"2023-03-02T05:50:10 +09:00","2022-09-29"]
["DEV",1000041,104,{"$f":"INDEX([2]KOR_StringTable!$C:$C,MATCH(E45,[2]KOR_StringTable!$B:$B,0))","v":"경사진 언덕길"},"GreenFarm_Yard_10","Yard_icon_2",0,11,22,10,"2023-03-02T05:50:10 +09:00","2022-09-29"]
["DEV",1000042,100,{"$f":"INDEX([2]KOR_StringTable!$C:$C,MATCH(E46,[2]KOR_StringTable!$B:$B,0))","v":"트로피칼 파라다이스 작은 앞뜰"},"Yard_1000030","Yard_icon_3",0,1,22,10,"2023-03-02T05:50:10 +09:00","2022-09-29"]
["DEV",1000043,100,{"$f":"INDEX([2]KOR_StringTable!$C:$C,MATCH(E47,[2]KOR_StringTable!$B:$B,0))","v":"트로피칼 파라다이스의 코트야드"},"Yard_1000031","Yard_icon_5",0,2,22,10,"2023-03-02T05:50:10 +09:00","2022-09-29"]
["DEV",1000044,100,{"$f":"INDEX([2]KOR_StringTable!$C:$C,MATCH(E48,[2]KOR_StringTable!$B:$B,0))","v":"트로피칼 파라다이스의 파티오"},"Yard_1000032","Yard_icon_3",0,3,22,10,"2023-03-02T05:50:10 +09:00","2022-09-29"]
["DEV",1000045,100,{"$f":"INDEX([2]KOR_StringTable!$C:$C,MATCH(E49,[2]KOR_StringTable!$B:$B,0))","v":"트로피칼 파라다이스의 시크릿 가든"},"Yard_1000033","Yard_icon_3",0,4,22,10,"2023-03-02T05:50:10 +09:00","2022-09-29"]
["DEV",1000046,100,{"$f":"INDEX([2]KOR_StringTable!$C:$C,MATCH(E50,[2]KOR_StringTable!$B:$B,0))","v":"트로피칼 파라다이스의 전망 좋은 해변"},"Yard_1000034","Yard_icon_3",0,5,22,10,"2023-03-02T05:50:10 +09:00","2022-09-29"]
["DEV",1000047,100,{"$f":"INDEX([2]KOR_StringTable!$C:$C,MATCH(E51,[2]KOR_StringTable!$B:$B,0))","v":"트로피칼 파라다이스의 넓은 바다"},"Yard_1000035","Yard_icon_3",0,6,22,10,"2023-03-02T05:50:10 +09:00","2022-09-29"]
["DEV",1000048,100,{"$f":"INDEX([2]KOR_StringTable!$C:$C,MATCH(E52,[2]KOR_StringTable!$B:$B,0))","v":"트로피칼 파라다이스의 뒷뜰"},"Yard_1000036","Yard_icon_4",0,7,22,10,"2023-03-02T05:50:10 +09:00","2022-09-29"]
["DEV",1000049,100,{"$f":"INDEX([2]KOR_StringTable!$C:$C,MATCH(E53,[2]KOR_StringTable!$B:$B,0))","v":"트로피칼 파라다이스의 숲"},"Yard_1000037","Yard_icon_3",0,8,22,10,"2023-03-02T05:50:10 +09:00","2022-09-29"]
["DEV",1000050,100,{"$f":"INDEX([2]KOR_StringTable!$C:$C,MATCH(E54,[2]KOR_StringTable!$B:$B,0))","v":"트로피칼 파라다이스의 넓은 해변"},"Yard_1000038","Yard_icon_3",0,9,22,10,"2023-03-02T05:50:10 +09:00","2022-09-29"]
["DEV",1000051,100,{"$f":"INDEX([2]KOR_StringTable!$C:$C,MATCH(E55,[2]KOR_StringTable!$B:$B,0))","v":"트로피칼 파라다이스의 시크릿 해변"},"Yard_1000039","Yard_icon_4",0,10,22,10,"2023-03-02T05:50:10 +09:00","2022-09-29"]
["DEV",1000052,104,{"$f":"INDEX([2]KOR_StringTable!$C:$C,MATCH(E56,[2]KOR_StringTable!$B:$B,0))","v":"언덕 위 숲 속 골짜기"},"GreenFarm_Yard_11","Yard_icon_1",0,12,22,10,"2023-03-02T05:50:10 +09:00","2022-09-29"]
["DEV",1000053,104,{"$f":"INDEX([2]KOR_StringTable!$C:$C,MATCH(E57,[2]KOR_StringTable!$B:$B,0))","v":"향기의 오솔길"},"GreenFarm_Yard_12","Yard_icon_1",0,13,22,10,"2023-03-02T05:50:10 +09:00","2022-09-29"]
["DEV",1000054,104,{"$f":"INDEX([2]KOR_StringTable!$C:$C,MATCH(E58,[2]KOR_StringTable!$B:$B,0))","v":"작은 온실"},"GreenFarm_Yard_13","Yard_icon_1",0,14,22,10,"2023-03-02T05:50:10 +09:00","2022-09-29"]
["DEV",1000055,104,{"$f":"INDEX([2]KOR_StringTable!$C:$C,MATCH(E59,[2]KOR_StringTable!$B:$B,0))","v":"별빛의 들판"},"GreenFarm_Yard_14","Yard_icon_1",0,15,22,10,"2023-03-02T05:50:10 +09:00","2022-09-29"]
["DEV",1000056,104,{"$f":"INDEX([2]KOR_StringTable!$C:$C,MATCH(E60,[2]KOR_StringTable!$B:$B,0))","v":"비밀의 동산"},"GreenFarm_Yard_15","Yard_icon_1",0,16,22,10,"2023-03-02T05:50:10 +09:00","2022-09-29"]
["DEV",1000057,102,{"$f":"INDEX([2]KOR_StringTable!$C:$C,MATCH(E61,[2]KOR_StringTable!$B:$B,0))","v":"블로썸 코티지의 화사한 정원"},"Yard_1000040","Yard_icon_5",0,11,22,10,"2023-03-02T05:50:10 +09:00","2022-09-29"]
["DEV",1000058,102,{"$f":"INDEX([2]KOR_StringTable!$C:$C,MATCH(E62,[2]KOR_StringTable!$B:$B,0))","v":"블로썸 코티지의 프라이빗 가든"},"Yard_1000041","Yard_icon_3",0,12,22,10,"2023-03-02T05:50:10 +09:00","2022-09-29"]
["DEV",1000059,102,{"$f":"INDEX([2]KOR_StringTable!$C:$C,MATCH(E63,[2]KOR_StringTable!$B:$B,0))","v":"블로썸 코티지의 장미 정원"},"Yard_1000042","Yard_icon_6",0,13,22,10,"2023-03-02T05:50:10 +09:00","2022-09-29"]
["DEV",1000060,102,{"$f":"INDEX([2]KOR_StringTable!$C:$C,MATCH(E64,[2]KOR_StringTable!$B:$B,0))","v":"블로썸 코티지의 포근한 뜰"},"Yard_1000043","Yard_icon_2",0,14,22,10,"2023-03-02T05:50:10 +09:00","2022-09-29"]
["DEV",1000061,102,{"$f":"INDEX([2]KOR_StringTable!$C:$C,MATCH(E65,[2]KOR_StringTable!$B:$B,0))","v":"블로썸 코티지의 작은 오솔길"},"Yard_1000044","Yard_icon_3",0,15,22,10,"2023-03-02T05:50:10 +09:00","2022-09-29"]
["DEV",1000062,102,{"$f":"INDEX([2]KOR_StringTable!$C:$C,MATCH(E66,[2]KOR_StringTable!$B:$B,0))","v":"블로썸 코티지의 반짝이는 연못"},"Yard_1000045","Yard_icon_5",0,16,22,10,"2023-03-02T05:50:10 +09:00","2022-09-29"]
["DEV",1000063,102,{"$f":"INDEX([2]KOR_StringTable!$C:$C,MATCH(E67,[2]KOR_StringTable!$B:$B,0))","v":"블로썸 코티지의 허브 가든"},"Yard_1000046","Yard_icon_3",0,17,22,10,"2023-03-02T05:50:10 +09:00","2022-09-29"]
["DEV",1000064,102,{"$f":"INDEX([2]KOR_StringTable!$C:$C,MATCH(E68,[2]KOR_StringTable!$B:$B,0))","v":"블로썸 코티지의 달빛 정원"},"Yard_1000047","Yard_icon_3",0,18,22,10,"2023-03-02T05:50:10 +09:00","2022-09-29"]
["DEV",1000065,102,{"$f":"INDEX([2]KOR_StringTable!$C:$C,MATCH(E69,[2]KOR_StringTable!$B:$B,0))","v":"블로썸 코티지의 포도 덩굴 아래"},"Yard_1000048","Yard_icon_4",0,19,22,10,"2023-03-02T05:50:10 +09:00","2022-09-29"]
["DEV",1000066,102,{"$f":"INDEX([2]KOR_StringTable!$C:$C,MATCH(E70,[2]KOR_StringTable!$B:$B,0))","v":"블로썸 코티지의 푸른 초원"},"Yard_1000049","Yard_icon_5",0,20,22,10,"2023-03-02T05:50:10 +09:00","2022-09-29"]
["DEV",1000067,102,{"$f":"INDEX([2]KOR_StringTable!$C:$C,MATCH(E71,[2]KOR_StringTable!$B:$B,0))","v":"블로썸 코티지의 새벽 안개 숲"},"Yard_1000050","Yard_icon_3",0,21,22,10,"2023-03-02T05:50:10 +09:00","2022-09-29"]
["DEV",1000068,102,{"$f":"INDEX([2]KOR_StringTable!$C:$C,MATCH(E72,[2]KOR_StringTable!$B:$B,0))","v":"블로썸 코티지의 여우길"},"Yard_1000051","Yard_icon_3",0,22,22,10,"2023-03-02T05:50:10 +09:00","2022-09-29"]
["DEV",1000069,102,{"$f":"INDEX([2]KOR_StringTable!$C:$C,MATCH(E73,[2]KOR_StringTable!$B:$B,0))","v":"블로썸 코티지의 황금빛 노을 정원"},"Yard_1000052","Yard_icon_3",0,23,22,10,"2023-03-02T05:50:10 +09:00","2022-09-29"]
["DEV",1000070,102,{"$f":"INDEX([2]KOR_StringTable!$C:$C,MATCH(E74,[2]KOR_StringTable!$B:$B,0))","v":"블로썸 코티지의 피크닉 숲속"},"Yard_1000053","Yard_icon_4",0,24,22,10,"2023-03-02T05:50:10 +09:00","2022-09-29"]
["DEV",1000071,102,{"$f":"INDEX([2]KOR_StringTable!$C:$C,MATCH(E75,[2]KOR_StringTable!$B:$B,0))","v":"블로썸 코티지의 새들이 머무는 뜰"},"Yard_1000054","Yard_icon_1",0,25,22,10,"2023-03-02T05:50:10 +09:00","2022-09-29"]
["DEV",1000072,100,{"$f":"INDEX([2]KOR_StringTable!$C:$C,MATCH(E76,[2]KOR_StringTable!$B:$B,0))","v":"트로피칼 파라다이스의 작은 오아시스"},"Yard_1000055","Yard_icon_5",0,11,22,10,"2023-03-02T05:50:10 +09:00","2022-09-29"]
["DEV",1000073,100,{"$f":"INDEX([2]KOR_StringTable!$C:$C,MATCH(E77,[2]KOR_StringTable!$B:$B,0))","v":"트로피칼 파라다이스의 프라이빗 라군"},"Yard_1000056","Yard_icon_3",0,12,22,10,"2023-03-02T05:50:10 +09:00","2022-09-29"]
["DEV",1000074,100,{"$f":"INDEX([2]KOR_StringTable!$C:$C,MATCH(E78,[2]KOR_StringTable!$B:$B,0))","v":"트로피칼 파라다이스의 바닷가 정원"},"Yard_1000057","Yard_icon_6",0,13,22,10,"2023-03-02T05:50:10 +09:00","2022-09-29"]
["DEV",1000075,100,{"$f":"INDEX([2]KOR_StringTable!$C:$C,MATCH(E79,[2]KOR_StringTable!$B:$B,0))","v":"트로피칼 파라다이스의 코코넛 숲"},"Yard_1000058","Yard_icon_2",0,14,22,10,"2023-03-02T05:50:10 +09:00","2022-09-29"]
["DEV",1000076,100,{"$f":"INDEX([2]KOR_StringTable!$C:$C,MATCH(E80,[2]KOR_StringTable!$B:$B,0))","v":"트로피칼 파라다이스의 황금빛 모래사장"},"Yard_1000059","Yard_icon_5",0,15,22,10,"2023-03-02T05:50:10 +09:00","2022-09-29"]
["DEV",1000077,100,{"$f":"INDEX([2]KOR_StringTable!$C:$C,MATCH(E81,[2]KOR_StringTable!$B:$B,0))","v":"트로피칼 파라다이스의 바다 내음 정원"},"Yard_1000060","Yard_icon_3",0,16,22,10,"2023-03-02T05:50:10 +09:00","2022-09-29"]
["DEV",1000078,100,{"$f":"INDEX([2]KOR_StringTable!$C:$C,MATCH(E82,[2]KOR_StringTable!$B:$B,0))","v":"트로피칼 파라다이스의 야자수 쉼터"},"Yard_1000061","Yard_icon_3",0,17,22,10,"2023-03-02T05:50:10 +09:00","2022-09-29"]
["DEV",1000079,100,{"$f":"INDEX([2]KOR_StringTable!$C:$C,MATCH(E83,[2]KOR_StringTable!$B:$B,0))","v":"트로피칼 파라다이스의 선셋 테라스"},"Yard_1000062","Yard_icon_3",0,18,22,10,"2023-03-02T05:50:10 +09:00","2022-09-29"]
["DEV",1000080,100,{"$f":"INDEX([2]KOR_StringTable!$C:$C,MATCH(E84,[2]KOR_StringTable!$B:$B,0))","v":"트로피칼 파라다이스의 조용한 파도 앞뜰"},"Yard_1000063","Yard_icon_3",0,19,22,10,"2023-03-02T05:50:10 +09:00","2022-09-29"]
["DEV",1000081,100,{"$f":"INDEX([2]KOR_StringTable!$C:$C,MATCH(E85,[2]KOR_StringTable!$B:$B,0))","v":"트로피칼 파라다이스의 반짝이는 리프"},"Yard_1000064","Yard_icon_5",0,20,22,10,"2023-03-02T05:50:10 +09:00","2022-09-29"]
["DEV",1000082,100,{"$f":"INDEX([2]KOR_StringTable!$C:$C,MATCH(E86,[2]KOR_StringTable!$B:$B,0))","v":"트로피칼 파라다이스의 열대 정원"},"Yard_1000065","Yard_icon_3",0,21,22,10,"2023-03-02T05:50:10 +09:00","2022-09-29"]
["DEV",1000083,100,{"$f":"INDEX([2]KOR_StringTable!$C:$C,MATCH(E87,[2]KOR_StringTable!$B:$B,0))","v":"트로피칼 파라다이스의 푸른 섬 코너"},"Yard_1000066","Yard_icon_3",0,22,22,10,"2023-03-02T05:50:10 +09:00","2022-09-29"]
["DEV",1000084,100,{"$f":"INDEX([2]KOR_StringTable!$C:$C,MATCH(E88,[2]KOR_StringTable!$B:$B,0))","v":"트로피칼 파라다이스의 잔잔한 라군"},"Yard_1000067","Yard_icon_3",0,23,22,10,"2023-03-02T05:50:10 +09:00","2022-09-29"]
["DEV",1000085,100,{"$f":"INDEX([2]KOR_StringTable!$C:$C,MATCH(E89,[2]KOR_StringTable!$B:$B,0))","v":"트로피칼 파라다이스의 달빛 해변"},"Yard_1000068","Yard_icon_4",0,24,22,10,"2023-03-02T05:50:10 +09:00","2022-09-29"]
["DEV",1000086,100,{"$f":"INDEX([2]KOR_StringTable!$C:$C,MATCH(E90,[2]KOR_StringTable!$B:$B,0))","v":"트로피칼 파라다이스의 물놀이 공간"},"Yard_1000069","Yard_icon_1",0,25,22,10,"2023-03-02T05:50:10 +09:00","2022-09-29"]
["DEV",1000087,103,{"$f":"INDEX([2]KOR_StringTable!$C:$C,MATCH(E91,[2]KOR_StringTable!$B:$B,0))","v":"어반 홈스테드의 루프탑 가든"},"Yard_1000070","Yard_icon_5",0,11,22,10,"2023-03-02T05:50:10 +09:00","2022-09-29"]
["DEV",1000088,103,{"$f":"INDEX([2]KOR_StringTable!$C:$C,MATCH(E92,[2]KOR_StringTable!$B:$B,0))","v":"어반 홈스테드의 따뜻한 베란다"},"Yard_1000071","Yard_icon_3",0,12,22,10,"2023-03-02T05:50:10 +09:00","2022-09-29"]
["DEV",1000089,103,{"$f":"INDEX([2]KOR_StringTable!$C:$C,MATCH(E93,[2]KOR_StringTable!$B:$B,0))","v":"어반 홈스테드의 프라이빗 테라스"},"Yard_1000072","Yard_icon_6",0,13,22,10,"2023-03-02T05:50:10 +09:00","2022-09-29"]
["DEV",1000090,103,{"$f":"INDEX([2]KOR_StringTable!$C:$C,MATCH(E94,[2]KOR_StringTable!$B:$B,0))","v":"어반 홈스테드의 바람이 부는 정원"},"Yard_1000073","Yard_icon_2",0,14,22,10,"2023-03-02T05:50:10 +09:00","2022-09-29"]
["DEV",1000091,103,{"$f":"INDEX([2]KOR_StringTable!$C:$C,MATCH(E95,[2]KOR_StringTable!$B:$B,0))","v":"어반 홈스테드의 잔디가 깔린 앞마당"},"Yard_1000074","Yard_icon_3",0,15,22,10,"2023-03-02T05:50:10 +09:00","2022-09-29"]
["DEV",1000092,103,{"$f":"INDEX([2]KOR_StringTable!$C:$C,MATCH(E96,[2]KOR_StringTable!$B:$B,0))","v":"어반 홈스테드의 작은 오솔길"},"Yard_1000075","Yard_icon_5",0,16,22,10,"2023-03-02T05:50:10 +09:00","2022-09-29"]
["DEV",1000093,103,{"$f":"INDEX([2]KOR_StringTable!$C:$C,MATCH(E97,[2]KOR_StringTable!$B:$B,0))","v":"어반 홈스테드의 모던한 선룸"},"Yard_1000076","Yard_icon_3",0,17,22,10,"2023-03-02T05:50:10 +09:00","2022-09-29"]
["DEV",1000094,103,{"$f":"INDEX([2]KOR_StringTable!$C:$C,MATCH(E98,[2]KOR_StringTable!$B:$B,0))","v":"어반 홈스테드의 조용한 휴식처"},"Yard_1000077","Yard_icon_3",0,18,22,10,"2023-03-02T05:50:10 +09:00","2022-09-29"]
["DEV",1000095,103,{"$f":"INDEX([2]KOR_StringTable!$C:$C,MATCH(E99,[2]KOR_StringTable!$B:$B,0))","v":"어반 홈스테드의 브런치 테라스"},"Yard_1000078","Yard_icon_4",0,19,22,10,"2023-03-02T05:50:10 +09:00","2022-09-29"]
["DEV",1000096,103,{"$f":"INDEX([2]KOR_StringTable!$C:$C,MATCH(E100,[2]KOR_StringTable!$B:$B,0))","v":"어반 홈스테드의 가든 라운지"},"Yard_1000079","Yard_icon_5",0,20,22,10,"2023-03-02T05:50:10 +09:00","2022-09-29"]
["DEV",1000097,103,{"$f":"INDEX([2]KOR_StringTable!$C:$C,MATCH(E101,[2]KOR_StringTable!$B:$B,0))","v":"어반 홈스테드의 따뜻한 햇살 마당"},"Yard_1000080","Yard_icon_3",0,21,22,10,"2023-03-02T05:50:10 +09:00","2022-09-29"]
["DEV",1000098,103,{"$f":"INDEX([2]KOR_StringTable!$C:$C,MATCH(E102,[2]KOR_StringTable!$B:$B,0))","v":"어반 홈스테드의 힐링 공간"},"Yard_1000081","Yard_icon_3",0,22,22,10,"2023-03-02T05:50:10 +09:00","2022-09-29"]
["DEV",1000099,103,{"$f":"INDEX([2]KOR_StringTable!$C:$C,MATCH(E103,[2]KOR_StringTable!$B:$B,0))","v":"어반 홈스테드의 푸른 녹지"},"Yard_1000082","Yard_icon_3",0,23,22,10,"2023-03-02T05:50:10 +09:00","2022-09-29"]
["DEV",1000100,103,{"$f":"INDEX([2]KOR_StringTable!$C:$C,MATCH(E104,[2]KOR_StringTable!$B:$B,0))","v":"어반 홈스테드의 별이 빛나는 테라스"},"Yard_1000083","Yard_icon_4",0,24,22,10,"2023-03-02T05:50:10 +09:00","2022-09-29"]
["DEV",1000101,103,{"$f":"INDEX([2]KOR_StringTable!$C:$C,MATCH(E105,[2]KOR_StringTable!$B:$B,0))","v":"어반 홈스테드의 벽돌길 정원"},"Yard_1000084","Yard_icon_1",0,25,22,10,"2023-03-02T05:50:10 +09:00","2022-09-29"]
["DEV",1000102,101,{"$f":"INDEX([2]KOR_StringTable!$C:$C,MATCH(E106,[2]KOR_StringTable!$B:$B,0))","v":"로열 팰리스의 황금빛 정원"},"Yard_1000085","Yard_icon_5",0,11,22,10,"2023-03-02T05:50:10 +09:00","2022-09-29"]
["DEV",1000103,101,{"$f":"INDEX([2]KOR_StringTable!$C:$C,MATCH(E107,[2]KOR_StringTable!$B:$B,0))","v":"로열 팰리스의 장미 정원"},"Yard_1000086","Yard_icon_3",0,12,22,10,"2023-03-02T05:50:10 +09:00","2022-09-29"]
["DEV",1000104,101,{"$f":"INDEX([2]KOR_StringTable!$C:$C,MATCH(E108,[2]KOR_StringTable!$B:$B,0))","v":"로열 팰리스의 프라이빗 가든"},"Yard_1000087","Yard_icon_6",0,13,22,10,"2023-03-02T05:50:10 +09:00","2022-09-29"]
["DEV",1000105,101,{"$f":"INDEX([2]KOR_StringTable!$C:$C,MATCH(E109,[2]KOR_StringTable!$B:$B,0))","v":"로열 팰리스의 분수 광장"},"Yard_1000088","Yard_icon_2",0,14,22,10,"2023-03-02T05:50:10 +09:00","2022-09-29"]
["DEV",1000106,101,{"$f":"INDEX([2]KOR_StringTable!$C:$C,MATCH(E110,[2]KOR_StringTable!$B:$B,0))","v":"로열 팰리스의 왕가의 뜰"},"Yard_1000089","Yard_icon_3",0,15,22,10,"2023-03-02T05:50:10 +09:00","2022-09-29"]
["DEV",1000107,101,{"$f":"INDEX([2]KOR_StringTable!$C:$C,MATCH(E111,[2]KOR_StringTable!$B:$B,0))","v":"로열 팰리스의 대리석 테라스"},"Yard_1000090","Yard_icon_5",0,16,22,10,"2023-03-02T05:50:10 +09:00","2022-09-29"]
["DEV",1000108,101,{"$f":"INDEX([2]KOR_StringTable!$C:$C,MATCH(E112,[2]KOR_StringTable!$B:$B,0))","v":"로열 팰리스의 고요한 연못"},"Yard_1000091","Yard_icon_3",0,17,22,10,"2023-03-02T05:50:10 +09:00","2022-09-29"]
["DEV",1000109,101,{"$f":"INDEX([2]KOR_StringTable!$C:$C,MATCH(E113,[2]KOR_StringTable!$B:$B,0))","v":"로열 팰리스의 햇살 가득한 정원"},"Yard_1000092","Yard_icon_3",0,18,22,10,"2023-03-02T05:50:10 +09:00","2022-09-29"]
["DEV",1000110,101,{"$f":"INDEX([2]KOR_StringTable!$C:$C,MATCH(E114,[2]KOR_StringTable!$B:$B,0))","v":"로열 팰리스의 화려한 플라워 가든"},"Yard_1000093","Yard_icon_4",0,19,22,10,"2023-03-02T05:50:10 +09:00","2022-09-29"]
["DEV",1000111,101,{"$f":"INDEX([2]KOR_StringTable!$C:$C,MATCH(E115,[2]KOR_StringTable!$B:$B,0))","v":"로열 팰리스의 비밀스러운 미로 정원"},"Yard_1000094","Yard_icon_5",0,20,22,10,"2023-03-02T05:50:10 +09:00","2022-09-29"]
["DEV",1000112,101,{"$f":"INDEX([2]KOR_StringTable!$C:$C,MATCH(E116,[2]KOR_StringTable!$B:$B,0))","v":"로열 팰리스의 별빛 정원"},"Yard_1000095","Yard_icon_3",0,21,22,10,"2023-03-02T05:50:10 +09:00","2022-09-29"]
["DEV",1000113,101,{"$f":"INDEX([2]KOR_StringTable!$C:$C,MATCH(E117,[2]KOR_StringTable!$B:$B,0))","v":"로열 팰리스의 로맨틱한 발코니"},"Yard_1000096","Yard_icon_3",0,22,22,10,"2023-03-02T05:50:10 +09:00","2022-09-29"]
["DEV",1000114,101,{"$f":"INDEX([2]KOR_StringTable!$C:$C,MATCH(E118,[2]KOR_StringTable!$B:$B,0))","v":"로열 팰리스의 바람이 부는 테라스"},"Yard_1000097","Yard_icon_3",0,23,22,10,"2023-03-02T05:50:10 +09:00","2022-09-29"]
["DEV",1000115,101,{"$f":"INDEX([2]KOR_StringTable!$C:$C,MATCH(E119,[2]KOR_StringTable!$B:$B,0))","v":"로열 팰리스의 대저택 앞뜰"},"Yard_1000098","Yard_icon_4",0,24,22,10,"2023-03-02T05:50:10 +09:00","2022-09-29"]
["DEV",1000116,101,{"$f":"INDEX([2]KOR_StringTable!$C:$C,MATCH(E120,[2]KOR_StringTable!$B:$B,0))","v":"로열 팰리스의 우아한 산책로"},"Yard_1000099","Yard_icon_1",0,25,22,10,"2023-03-02T05:50:10 +09:00","2022-09-29"]

{"sheet":"Field","index":4,"n_rows":23,"n_cols":22,"rows_kept":23,"cut":false,"hidden":false,"merged":[]}
["ServiceType","Key","#FieldName","FieldName","IconID","FieldImage","IsSquare","IsHouse","BGMPrefabName","NightBGMPrefabName","CityID","IsShortcut","#IconTag","IconTag","FieldPrefabName","IsShortcutPopup","#EPlaceShortcutType","PlaceShortcutType","PlaceShortcutTypeString","OpenTime","#LiveDate","#UpdateVersion"]
["string","int","none","stringkey","string","string","bool","bool","string","string","int","bool","none","int","string","bool","none","EPlaceShortcutType","string","datetime","none","Client"]
["All","All","Client","Client","Client","Client","All","All","All","All","All","All","Client","Client","Client","Client","Client","Client","Client","All","Client","none"]
["서비스 타입","구역 ID","구역명","스트링 코드명","아이콘 ID","이미지명","광장 여부","하우스 여부","BGM 프리팹명","(밤) BGM 프리팹명 ","시티 ID","지도 숏컷 표시 여부","숏컷 아이콘 표시 ","숏컷 아이콘 표시","프리팹명","숏컷 팝업 출력 여부","숏컷 장소 종류","숏컷 장소 종류","숏컷 장소 스트링","오픈 시간","출시 일자","업데이트 버전"]
["DEV",100,{"$f":"INDEX([2]KOR_StringTable!$C:$C,MATCH(D5,[2]KOR_StringTable!$B:$B,0))","v":"트로피칼 파라다이스 하우스"},"Field_100","icon_house","Field100_image",0,1,"BGM_Vacation","BGM_Vacation_N",3,0,"없음",{"$f":"INDEX('NO_Table Parameter'!$J:$J,MATCH(M5,'NO_Table Parameter'!$K:$K,0))","v":0},"Field100",1,"마이 하우스",{"$f":"IFERROR(INDEX('NO_Table Parameter'!$M:$M,MATCH(Q5,'NO_Table Parameter'!$N:$N,0)),\"\")","v":1},{"$f":"IFERROR(INDEX([2]KOR_StringTable!$B:$B,MATCH(Q5,[2]KOR_StringTable!$C:$C,0)),\"\")","v":"My_House"},"2023-03-02T05:50:10 +09:00","2022-09-29"]
["DEV",101,{"$f":"INDEX([2]KOR_StringTable!$C:$C,MATCH(D6,[2]KOR_StringTable!$B:$B,0))","v":"로열 팰리스 하우스"},"Field_101","icon_house","Field101_image",0,1,"BGM_European","BGM_European_N",2,0,"없음",{"$f":"INDEX('NO_Table Parameter'!$J:$J,MATCH(M6,'NO_Table Parameter'!$K:$K,0))","v":0},"Field101",1,"마이 하우스",{"$f":"IFERROR(INDEX('NO_Table Parameter'!$M:$M,MATCH(Q6,'NO_Table Parameter'!$N:$N,0)),\"\")","v":1},{"$f":"IFERROR(INDEX([2]KOR_StringTable!$B:$B,MATCH(Q6,[2]KOR_StringTable!$C:$C,0)),\"\")","v":"My_House"},"2023-03-02T05:50:10 +09:00","2022-09-29"]
["DEV",102,{"$f":"INDEX([2]KOR_StringTable!$C:$C,MATCH(D7,[2]KOR_StringTable!$B:$B,0))","v":"블로썸 코티지 하우스"},"Field_102","icon_house","Field102_image",0,1,"BGM_Forest","BGM_City_N",1,0,"없음",{"$f":"INDEX('NO_Table Parameter'!$J:$J,MATCH(M7,'NO_Table Parameter'!$K:$K,0))","v":0},"Field102",1,"마이 하우스",{"$f":"IFERROR(INDEX('NO_Table Parameter'!$M:$M,MATCH(Q7,'NO_Table Parameter'!$N:$N,0)),\"\")","v":1},{"$f":"IFERROR(INDEX([2]KOR_StringTable!$B:$B,MATCH(Q7,[2]KOR_StringTable!$C:$C,0)),\"\")","v":"My_House"},"2023-03-02T05:50:10 +09:00","2022-09-29"]
["DEV",103,{"$f":"INDEX([2]KOR_StringTable!$C:$C,MATCH(D8,[2]KOR_StringTable!$B:$B,0))","v":"어반 홈스테드 하우스"},"Field_103","icon_house","Field103_image",0,1,"BGM_City","BGM_City_N",4,0,"없음",{"$f":"INDEX('NO_Table Parameter'!$J:$J,MATCH(M8,'NO_Table Parameter'!$K:$K,0))","v":0},"Field103",1,"마이 하우스",{"$f":"IFERROR(INDEX('NO_Table Parameter'!$M:$M,MATCH(Q8,'NO_Table Parameter'!$N:$N,0)),\"\")","v":1},{"$f":"IFERROR(INDEX([2]KOR_StringTable!$B:$B,MATCH(Q8,[2]KOR_StringTable!$C:$C,0)),\"\")","v":"My_House"},"2023-03-02T05:50:10 +09:00","2022-09-29"]
["DEV",104,{"$f":"INDEX([2]KOR_StringTable!$C:$C,MATCH(D9,[2]KOR_StringTable!$B:$B,0))","v":"마이 가든"},"Field_104","icon_greenfarm","Field104_image",0,0,null,null,null,0,"없음",{"$f":"INDEX('NO_Table Parameter'!$J:$J,MATCH(M9,'NO_Table Parameter'!$K:$K,0))","v":0},"GreenHouseField104",0,null,{"$f":"IFERROR(INDEX('NO_Table Parameter'!$M:$M,MATCH(Q9,'NO_Table Parameter'!$N:$N,0)),\"\")","v":""},{"$f":"IFERROR(INDEX([2]KOR_StringTable!$B:$B,MATCH(Q9,[2]KOR_StringTable!$C:$C,0)),\"\")","v":""},"2023-03-02T05:50:10 +09:00","2022-09-29"]
["DEV",105,{"$f":"INDEX([2]KOR_StringTable!$C:$C,MATCH(D10,[2]KOR_StringTable!$B:$B,0))","v":"센트럴 타운"},"Field_105","icon_town2","icon_town2",1,0,"BGM_CentralTown","BGM_CentralTown_N",1,1,"없음",{"$f":"INDEX('NO_Table Parameter'!$J:$J,MATCH(M10,'NO_Table Parameter'!$K:$K,0))","v":0},"CentralTownField105",1,"만남의 공간",{"$f":"IFERROR(INDEX('NO_Table Parameter'!$M:$M,MATCH(Q10,'NO_Table Parameter'!$N:$N,0)),\"\")","v":3},{"$f":"IFERROR(INDEX([2]KOR_StringTable!$B:$B,MATCH(Q10,[2]KOR_StringTable!$C:$C,0)),\"\")","v":"Plaza"},"2023-03-02T05:50:10 +09:00","2022-09-29"]
["NONE",106,{"$f":"INDEX([2]KOR_StringTable!$C:$C,MATCH(D11,[2]KOR_StringTable!$B:$B,0))","v":"어드벤처 포레스트"},"Field_106","icon_adventure","Field106_image",1,0,"BGM_EverGreen","BGM_EverGreen_N",2,0,"없음",{"$f":"INDEX('NO_Table Parameter'!$J:$J,MATCH(M11,'NO_Table Parameter'!$K:$K,0))","v":0},"LandMark106",0,"만남의 공간",{"$f":"IFERROR(INDEX('NO_Table Parameter'!$M:$M,MATCH(Q11,'NO_Table Parameter'!$N:$N,0)),\"\")","v":3},{"$f":"IFERROR(INDEX([2]KOR_StringTable!$B:$B,MATCH(Q11,[2]KOR_StringTable!$C:$C,0)),\"\")","v":"Plaza"},"2023-03-02T05:50:10 +09:00","2022-09-29"]
["DEV",107,{"$f":"INDEX([2]KOR_StringTable!$C:$C,MATCH(D12,[2]KOR_StringTable!$B:$B,0))","v":"퀸즈 팰리스 랜드마크"},"Field_107","Field107_icon","Field107_image",1,0,"BGM_QueenPalace","BGM_QueenPalace_N",1,0,"없음",{"$f":"INDEX('NO_Table Parameter'!$J:$J,MATCH(M12,'NO_Table Parameter'!$K:$K,0))","v":0},"QueensPalaceLandMark001",0,null,{"$f":"IFERROR(INDEX('NO_Table Parameter'!$M:$M,MATCH(Q12,'NO_Table Parameter'!$N:$N,0)),\"\")","v":""},{"$f":"IFERROR(INDEX([2]KOR_StringTable!$B:$B,MATCH(Q12,[2]KOR_StringTable!$C:$C,0)),\"\")","v":""},"2023-03-02T05:50:10 +09:00","2022-09-29"]
["NONE",108,{"$f":"INDEX([2]KOR_StringTable!$C:$C,MATCH(D13,[2]KOR_StringTable!$B:$B,0))","v":"패션 스트릿"},"Field_108","icon_fashionstreet","Field108_image",1,0,"BGM_FashionStreet","BGM_FashionStreet_N",4,1,"없음",{"$f":"INDEX('NO_Table Parameter'!$J:$J,MATCH(M13,'NO_Table Parameter'!$K:$K,0))","v":0},"Field108",0,"만남의 공간",{"$f":"IFERROR(INDEX('NO_Table Parameter'!$M:$M,MATCH(Q13,'NO_Table Parameter'!$N:$N,0)),\"\")","v":3},{"$f":"IFERROR(INDEX([2]KOR_StringTable!$B:$B,MATCH(Q13,[2]KOR_StringTable!$C:$C,0)),\"\")","v":"Plaza"},"2023-03-02T05:50:10 +09:00","2022-09-29"]
["DEV",109,{"$f":"INDEX([2]KOR_StringTable!$C:$C,MATCH(D14,[2]KOR_StringTable!$B:$B,0))","v":"그리너리 시티 빌리지"},"Field_109","icon_town","Field109_image",1,0,null,null,1,0,"없음",{"$f":"INDEX('NO_Table Parameter'!$J:$J,MATCH(M14,'NO_Table Parameter'!$K:$K,0))","v":0},"Village000001",1,"마이 빌리지",{"$f":"IFERROR(INDEX('NO_Table Parameter'!$M:$M,MATCH(Q14,'NO_Table Parameter'!$N:$N,0)),\"\")","v":2},{"$f":"IFERROR(INDEX([2]KOR_StringTable!$B:$B,MATCH(Q14,[2]KOR_StringTable!$C:$C,0)),\"\")","v":"My_Village"},"2023-03-02T05:50:10 +09:00","2022-09-29"]
["DEV",110,{"$f":"INDEX([2]KOR_StringTable!$C:$C,MATCH(D15,[2]KOR_StringTable!$B:$B,0))","v":"어반뷰 시티 빌리지"},"Field_110","icon_town","Field109_image",1,0,null,null,2,0,"없음",{"$f":"INDEX('NO_Table Parameter'!$J:$J,MATCH(M15,'NO_Table Parameter'!$K:$K,0))","v":0},"Village000002",1,"마이 빌리지",{"$f":"IFERROR(INDEX('NO_Table Parameter'!$M:$M,MATCH(Q15,'NO_Table Parameter'!$N:$N,0)),\"\")","v":2},{"$f":"IFERROR(INDEX([2]KOR_StringTable!$B:$B,MATCH(Q15,[2]KOR_StringTable!$C:$C,0)),\"\")","v":"My_Village"},"2023-03-02T05:50:10 +09:00","2022-09-29"]
["DEV",111,{"$f":"INDEX([2]KOR_StringTable!$C:$C,MATCH(D16,[2]KOR_StringTable!$B:$B,0))","v":"트로피칼 선 시티 빌리지"},"Field_111","icon_town","Field109_image",1,0,null,null,3,0,"없음",{"$f":"INDEX('NO_Table Parameter'!$J:$J,MATCH(M16,'NO_Table Parameter'!$K:$K,0))","v":0},"Village000003",1,"마이 빌리지",{"$f":"IFERROR(INDEX('NO_Table Parameter'!$M:$M,MATCH(Q16,'NO_Table Parameter'!$N:$N,0)),\"\")","v":2},{"$f":"IFERROR(INDEX([2]KOR_StringTable!$B:$B,MATCH(Q16,[2]KOR_StringTable!$C:$C,0)),\"\")","v":"My_Village"},"2023-03-02T05:50:10 +09:00","2022-09-29"]
["DEV",112,{"$f":"INDEX([2]KOR_StringTable!$C:$C,MATCH(D17,[2]KOR_StringTable!$B:$B,0))","v":"퀸즈 팰리스 시티 빌리지"},"Field_112","icon_town","Field109_image",1,0,null,null,4,0,"없음",{"$f":"INDEX('NO_Table Parameter'!$J:$J,MATCH(M17,'NO_Table Parameter'!$K:$K,0))","v":0},"Village000004",1,"마이 빌리지",{"$f":"IFERROR(INDEX('NO_Table Parameter'!$M:$M,MATCH(Q17,'NO_Table Parameter'!$N:$N,0)),\"\")","v":2},{"$f":"IFERROR(INDEX([2]KOR_StringTable!$B:$B,MATCH(Q17,[2]KOR_StringTable!$C:$C,0)),\"\")","v":"My_Village"},"2023-03-02T05:50:10 +09:00","2022-09-29"]
["DEV",2001,{"$f":"INDEX([2]KOR_StringTable!$C:$C,MATCH(D18,[2]KOR_StringTable!$B:$B,0))","v":"패션 스퀘어"},"field_2001","fashion_ps","field_2001_image",1,0,"BGM_FashionSquare","BGM_FashionSquare",4,1,"없음",{"$f":"INDEX('NO_Table Parameter'!$J:$J,MATCH(M18,'NO_Table Parameter'!$K:$K,0))","v":0},"Field2001",1,"만남의 공간",{"$f":"IFERROR(INDEX('NO_Table Parameter'!$M:$M,MATCH(Q18,'NO_Table Parameter'!$N:$N,0)),\"\")","v":3},{"$f":"IFERROR(INDEX([2]KOR_StringTable!$B:$B,MATCH(Q18,[2]KOR_StringTable!$C:$C,0)),\"\")","v":"Plaza"},"1999-01-01T00:00:00 +09:00","2024-12-18"]
["DEV",2002,{"$f":"INDEX([2]KOR_StringTable!$C:$C,MATCH(D19,[2]KOR_StringTable!$B:$B,0))","v":"미용실"},"HairShop",null,null,0,0,null,null,null,0,"없음",{"$f":"INDEX('NO_Table Parameter'!$J:$J,MATCH(M19,'NO_Table Parameter'!$K:$K,0))","v":0},"NPCHousingField113",0,null,{"$f":"IFERROR(INDEX('NO_Table Parameter'!$M:$M,MATCH(Q19,'NO_Table Parameter'!$N:$N,0)),\"\")","v":""},{"$f":"IFERROR(INDEX([2]KOR_StringTable!$B:$B,MATCH(Q19,[2]KOR_StringTable!$C:$C,0)),\"\")","v":""},"1999-01-01T00:00:00 +09:00","2024-12-18"]
["DEV",2003,{"$f":"INDEX([2]KOR_StringTable!$C:$C,MATCH(D20,[2]KOR_StringTable!$B:$B,0))","v":"시나모롤 스퀘어"},"Field_2003","icon_cinnamoroll","Field_2003_image",1,0,"BGM_Cinnamoroll","BGM_Cinnamoroll",5,1,"없음",{"$f":"INDEX('NO_Table Parameter'!$J:$J,MATCH(M20,'NO_Table Parameter'!$K:$K,0))","v":0},"Field2003",1,"만남의 공간",{"$f":"IFERROR(INDEX('NO_Table Parameter'!$M:$M,MATCH(Q20,'NO_Table Parameter'!$N:$N,0)),\"\")","v":3},{"$f":"IFERROR(INDEX([2]KOR_StringTable!$B:$B,MATCH(Q20,[2]KOR_StringTable!$C:$C,0)),\"\")","v":"Plaza"},"1999-01-01T00:00:00 +09:00","2024-12-18"]
["DEV",2004,{"$f":"INDEX([2]KOR_StringTable!$C:$C,MATCH(D21,[2]KOR_StringTable!$B:$B,0))","v":"타운맵"},"Town_Map",null,null,0,0,"BGM_EverGreen","BGM_EverGreen",null,0,"없음",{"$f":"INDEX('NO_Table Parameter'!$J:$J,MATCH(M21,'NO_Table Parameter'!$K:$K,0))","v":0},"Field2004",0,null,{"$f":"IFERROR(INDEX('NO_Table Parameter'!$M:$M,MATCH(Q21,'NO_Table Parameter'!$N:$N,0)),\"\")","v":""},{"$f":"IFERROR(INDEX([2]KOR_StringTable!$B:$B,MATCH(Q21,[2]KOR_StringTable!$C:$C,0)),\"\")","v":""},"1999-01-01T00:00:00 +09:00","2024-12-18"]
["DEV",2005,{"$f":"INDEX([2]KOR_StringTable!$C:$C,MATCH(D22,[2]KOR_StringTable!$B:$B,0))","v":"플레이 스퀘어"},"Field_2005",null,null,0,0,"BGM_PlaySquare","BGM_PlaySquare",null,0,"없음",{"$f":"INDEX('NO_Table Parameter'!$J:$J,MATCH(M22,'NO_Table Parameter'!$K:$K,0))","v":0},"Field2005",0,null,{"$f":"IFERROR(INDEX('NO_Table Parameter'!$M:$M,MATCH(Q22,'NO_Table Parameter'!$N:$N,0)),\"\")","v":""},{"$f":"IFERROR(INDEX([2]KOR_StringTable!$B:$B,MATCH(Q22,[2]KOR_StringTable!$C:$C,0)),\"\")","v":""},"1999-01-01T00:00:00 +09:00","2024-12-18"]
["DEV",2006,{"$f":"INDEX([2]KOR_StringTable!$C:$C,MATCH(D23,[2]KOR_StringTable!$B:$B,0))","v":"시나모롤 하우스"},"Field_2006",null,null,1,0,"BGM_Cinnamoroll","BGM_Cinnamoroll",null,0,"없음",{"$f":"INDEX('NO_Table Parameter'!$J:$J,MATCH(M23,'NO_Table Parameter'!$K:$K,0))","v":0},"CinnamorollHouse2006",0,null,{"$f":"IFERROR(INDEX('NO_Table Parameter'!$M:$M,MATCH(Q23,'NO_Table Parameter'!$N:$N,0)),\"\")","v":""},{"$f":"IFERROR(INDEX([2]KOR_StringTable!$B:$B,MATCH(Q23,[2]KOR_StringTable!$C:$C,0)),\"\")","v":""},"1999-01-01T00:00:00 +09:00","2024-12-18"]

{"sheet":"SaveRoom","index":5,"n_rows":20,"n_cols":12,"rows_kept":20,"cut":false,"hidden":false,"merged":[]}
["ServiceType","Key","#FieldName","FieldID","Sortindex","#BuyPriceType","BuyPriceType","BuyPriceValue","IsShow","OpenTime","#LiveDate","#UpdateVersion"]
["string","int","none","int","int","none","ERewardType","int","int","datetime","none","none"]
["All","All","Client","All","Client","All","All","All","All","All","Client","Client"]
["서비스 타입","저장룸 ID","구역명","구역 ID","순서","구매재화종류","구매재화종류","재화 값","표시 여부","오픈 시간","출시 일자","업데이트 버전"]
["DEV",1000000,"에버그린 스테이트 하우스",{"$f":"IF(ISTEXT(C5),INDEX(Field!$B$5:$B$1048576,MATCH(SaveRoom!C5,Field!$C$5:$C$1048576,0)),\"\")","v":{"$error":"#N/A"}},1,"골드",{"$f":"INDEX('NO_Table Parameter'!$G:$G,MATCH(F5,'NO_Table Parameter'!$H:$H,0))","v":1},1000000,1,"2023-03-02T05:50:10 +09:00","2022-11-10",0]
["DEV",1000001,"에버그린 스테이트 하우스",{"$f":"IF(ISTEXT(C6),INDEX(Field!$B$5:$B$1048576,MATCH(SaveRoom!C6,Field!$C$5:$C$1048576,0)),\"\")","v":{"$error":"#N/A"}},2,"주얼",{"$f":"INDEX('NO_Table Parameter'!$G:$G,MATCH(F6,'NO_Table Parameter'!$H:$H,0))","v":4},100,1,"2023-03-02T05:50:10 +09:00","2022-11-10",0]
["DEV",1000002,"에버그린 스테이트 하우스",{"$f":"IF(ISTEXT(C7),INDEX(Field!$B$5:$B$1048576,MATCH(SaveRoom!C7,Field!$C$5:$C$1048576,0)),\"\")","v":{"$error":"#N/A"}},3,"주얼",{"$f":"INDEX('NO_Table Parameter'!$G:$G,MATCH(F7,'NO_Table Parameter'!$H:$H,0))","v":4},100,1,"2023-03-02T05:50:10 +09:00","2022-11-10",0]
["DEV",1000003,"에버그린 스테이트 하우스",{"$f":"IF(ISTEXT(C8),INDEX(Field!$B$5:$B$1048576,MATCH(SaveRoom!C8,Field!$C$5:$C$1048576,0)),\"\")","v":{"$error":"#N/A"}},4,"주얼",{"$f":"INDEX('NO_Table Parameter'!$G:$G,MATCH(F8,'NO_Table Parameter'!$H:$H,0))","v":4},100,1,"2023-03-02T05:50:10 +09:00","2022-11-10",0]
["DEV",1000004,"어반뷰 스테이트 하우스",{"$f":"IF(ISTEXT(C9),INDEX(Field!$B$5:$B$1048576,MATCH(SaveRoom!C9,Field!$C$5:$C$1048576,0)),\"\")","v":{"$error":"#N/A"}},1,"골드",{"$f":"INDEX('NO_Table Parameter'!$G:$G,MATCH(F9,'NO_Table Parameter'!$H:$H,0))","v":1},1000000,1,"2023-03-02T05:50:10 +09:00","2022-11-10",0]
["DEV",1000005,"어반뷰 스테이트 하우스",{"$f":"IF(ISTEXT(C10),INDEX(Field!$B$5:$B$1048576,MATCH(SaveRoom!C10,Field!$C$5:$C$1048576,0)),\"\")","v":{"$error":"#N/A"}},2,"주얼",{"$f":"INDEX('NO_Table Parameter'!$G:$G,MATCH(F10,'NO_Table Parameter'!$H:$H,0))","v":4},100,1,"2023-03-02T05:50:10 +09:00","2022-11-10",0]
["DEV",1000006,"어반뷰 스테이트 하우스",{"$f":"IF(ISTEXT(C11),INDEX(Field!$B$5:$B$1048576,MATCH(SaveRoom!C11,Field!$C$5:$C$1048576,0)),\"\")","v":{"$error":"#N/A"}},3,"주얼",{"$f":"INDEX('NO_Table Parameter'!$G:$G,MATCH(F11,'NO_Table Parameter'!$H:$H,0))","v":4},100,1,"2023-03-02T05:50:10 +09:00","2022-11-10",0]
["DEV",1000007,"어반뷰 스테이트 하우스",{"$f":"IF(ISTEXT(C12),INDEX(Field!$B$5:$B$1048576,MATCH(SaveRoom!C12,Field!$C$5:$C$1048576,0)),\"\")","v":{"$error":"#N/A"}},4,"주얼",{"$f":"INDEX('NO_Table Parameter'!$G:$G,MATCH(F12,'NO_Table Parameter'!$H:$H,0))","v":4},100,1,"2023-03-02T05:50:10 +09:00","2022-11-10",0]
["DEV",1000008,"퀸즈 팰리스 스테이트 하우스",{"$f":"IF(ISTEXT(C13),INDEX(Field!$B$5:$B$1048576,MATCH(SaveRoom!C13,Field!$C$5:$C$1048576,0)),\"\")","v":{"$error":"#N/A"}},1,"골드",{"$f":"INDEX('NO_Table Parameter'!$G:$G,MATCH(F13,'NO_Table Parameter'!$H:$H,0))","v":1},1000000,1,"2023-03-02T05:50:10 +09:00","2022-11-10",0]
["DEV",1000009,"퀸즈 팰리스 스테이트 하우스",{"$f":"IF(ISTEXT(C14),INDEX(Field!$B$5:$B$1048576,MATCH(SaveRoom!C14,Field!$C$5:$C$1048576,0)),\"\")","v":{"$error":"#N/A"}},2,"주얼",{"$f":"INDEX('NO_Table Parameter'!$G:$G,MATCH(F14,'NO_Table Parameter'!$H:$H,0))","v":4},100,1,"2023-03-02T05:50:10 +09:00","2022-11-10",0]
["DEV",1000010,"퀸즈 팰리스 스테이트 하우스",{"$f":"IF(ISTEXT(C15),INDEX(Field!$B$5:$B$1048576,MATCH(SaveRoom!C15,Field!$C$5:$C$1048576,0)),\"\")","v":{"$error":"#N/A"}},3,"주얼",{"$f":"INDEX('NO_Table Parameter'!$G:$G,MATCH(F15,'NO_Table Parameter'!$H:$H,0))","v":4},100,1,"2023-03-02T05:50:10 +09:00","2022-11-10",0]
["DEV",1000011,"퀸즈 팰리스 스테이트 하우스",{"$f":"IF(ISTEXT(C16),INDEX(Field!$B$5:$B$1048576,MATCH(SaveRoom!C16,Field!$C$5:$C$1048576,0)),\"\")","v":{"$error":"#N/A"}},4,"주얼",{"$f":"INDEX('NO_Table Parameter'!$G:$G,MATCH(F16,'NO_Table Parameter'!$H:$H,0))","v":4},100,1,"2023-03-02T05:50:10 +09:00","2022-11-10",0]
["DEV",1000012,"트로피칼 선 스테이트 하우스",{"$f":"IF(ISTEXT(C17),INDEX(Field!$B$5:$B$1048576,MATCH(SaveRoom!C17,Field!$C$5:$C$1048576,0)),\"\")","v":{"$error":"#N/A"}},1,"골드",{"$f":"INDEX('NO_Table Parameter'!$G:$G,MATCH(F17,'NO_Table Parameter'!$H:$H,0))","v":1},1000000,1,"2023-03-02T05:50:10 +09:00","2022-11-10",0]
["DEV",1000013,"트로피칼 선 스테이트 하우스",{"$f":"IF(ISTEXT(C18),INDEX(Field!$B$5:$B$1048576,MATCH(SaveRoom!C18,Field!$C$5:$C$1048576,0)),\"\")","v":{"$error":"#N/A"}},2,"주얼",{"$f":"INDEX('NO_Table Parameter'!$G:$G,MATCH(F18,'NO_Table Parameter'!$H:$H,0))","v":4},100,1,"2023-03-02T05:50:10 +09:00","2022-11-10",0]
["DEV",1000014,"트로피칼 선 스테이트 하우스",{"$f":"IF(ISTEXT(C19),INDEX(Field!$B$5:$B$1048576,MATCH(SaveRoom!C19,Field!$C$5:$C$1048576,0)),\"\")","v":{"$error":"#N/A"}},3,"주얼",{"$f":"INDEX('NO_Table Parameter'!$G:$G,MATCH(F19,'NO_Table Parameter'!$H:$H,0))","v":4},100,1,"2023-03-02T05:50:10 +09:00","2022-11-10",0]
["DEV",1000015,"트로피칼 선 스테이트 하우스",{"$f":"IF(ISTEXT(C20),INDEX(Field!$B$5:$B$1048576,MATCH(SaveRoom!C20,Field!$C$5:$C$1048576,0)),\"\")","v":{"$error":"#N/A"}},4,"주얼",{"$f":"INDEX('NO_Table Parameter'!$G:$G,MATCH(F20,'NO_Table Parameter'!$H:$H,0))","v":4},100,1,"2023-03-02T05:50:10 +09:00","2022-11-10",0]