{"text_format":"1","workbook":"xlsx","n_sheets":6,"sheets":["NO_Table Parameter","Blueprint","Room","Yard","Field","SaveRoom"],"not_rendered":{"charts":0,"images":0,"macros":1,"external_links":2,"defined_names":2,"comments":0,"pivot_tables":0},"unopened":[],"bounds":{"document_bytes":16777216,"sheet_cells":100000,"rows_first":2000,"rows_last":500,"rows_between":2000,"halvings":0,"cell_chars":16384,"cell_head_chars":4096},"cells_cut":0,"cells_raw":0,"read":"whole","date_system":"1900"}

{"sheet":"NO_Table Parameter","index":0,"n_rows":41,"n_cols":14,"rows_kept":41,"cut":false,"hidden":false,"merged":[]}
[null,null,null,null,null,null,null,null,null,null,null,null,"[PF_EnumTypeData.xlsm]EPlaceShortcutType!Key","[PF_EnumTypeData.xlsm]EPlaceShortcutType!Desc"]
["BlueprintTable",null,null,null,null,null,"ERewardType",null,null,"EIconTag",null,null,"열거형 숫자","요약"]
["칼럼 영문명","자료형","칼럼 한글명","참조 테이블","설명",null,"ID","String",null,"ID","enum",null,1,"마이 하우스"]
["Key","int","도면 ID",null,"도면의 고유 주소 기재",null,1,"골드",null,0,"없음",null,2,"마이 빌리지"]
["BlueprintName","stringkey","스트링 코드명",null,"도면명 기재",null,2,"무료 주얼",null,1,"new",null,3,"만남의 공간"]
["IconID","string","아이콘 ID",null,"아이콘 ID 기재",null,3,"유료 주얼",null,2,"evnet",null,4,"특별관"]
["SortIndex","int","순서",null,"팝업창에 보여지는 순서 기재",null,4,"주얼",null,3,"premium"]
["IsSpecial","bool","특별 도면 여부",null,"스테이트별 스페셜 도면 여부",null,5,"하트",null,4,"hot"]
["SpecialFieldType","int","전용 필드 ID",null,"스페셜 도면의 스테이트 기입",null,6,"위시"]
["BuyPriceType","ERewardType","구매재화종류",null,"구매 재화 종류 기입",null,7,"패션"]
["BuyPriceValue","int","구매 값",null,"구매 재화 값 기입",null,8,"피스"]
[null,null,null,null,null,null,9,"기빙"]
["RoomTable",null,null,null,null,null,10,"경험치"]
["칼럼 영문명","자료형","칼럼 한글명","참조 테이블","설명",null,11,"호감도"]
["Key","int","룸 ID",null,"룸의 고유 주소 기재",null,12,"드릴"]
{"$rows_left_out":27}
{"sheet":"Blueprint","index":1,"n_rows":8,"n_cols":13,"rows_kept":8,"cut":false,"hidden":false,"merged":[]}
["ServiceType","Key","#BlueprintName","BlueprintName","IconID","SortIndex","FieldLimitType","#BuyPriceType","BuyPriceType","BuyPriceValue","OpenTime","#LiveDate","#UpdateVersion"]
["string","int","none","stringkey","string","int","int[]","none","ERewardType","int","datetime","none","Client"]
["All","All","Client","Client","Client","Client","Client","All","All","All","All","Client","none"]
["서비스 타입","도면 ID","도면명","스트링 코드명","아이콘 ID","순서","설치 제한 필드 ID","구매재화종류","구매재화종류","구매 값","오픈 시간","출시 일자","업데이트 버전"]
["DEV",1,{"$f":"INDEX([2]KOR_StringTable!$C:$C,MATCH(D5,[2]KOR_StringTable!$B:$B,0))","v":"로열 팰리스"},"Blueprint_1","Blueprint_icon_1",1,{"$f":"IF(ISTEXT(#REF!),LEFT(#REF!,FIND(\":\",#REF!)-1),\"\")","v":""},"주얼",{"$f":"INDEX('NO_Table Parameter'!$G:$G,MATCH(H5,'NO_Table Parameter'!$H:$H,0))","v":4},100,"2023-03-02T05:50:10 +09:00","2022-09-29",0]
["DEV",2,{"$f":"INDEX([2]KOR_StringTable!$C:$C,MATCH(D6,[2]KOR_StringTable!$B:$B,0))","v":"어반 홈스테드"},"Blueprint_2","Blueprint_icon_2",2,null,"주얼",{"$f":"INDEX('NO_Table Parameter'!$G:$G,MATCH(H6,'NO_Table Parameter'!$H:$H,0))","v":4},100,"2023-03-02T05:50:10 +09:00","2022-09-29",0]
["DEV",3,{"$f":"INDEX([2]KOR_StringTable!$C:$C,MATCH(D7,[2]KOR_StringTable!$B:$B,0))","v":"블로썸 코티지"},"Blueprint_3","Blueprint_icon_3",3,null,"주얼",{"$f":"INDEX('NO_Table Parameter'!$G:$G,MATCH(H7,'NO_Table Parameter'!$H:$H,0))","v":4},100,"2023-03-02T05:50:10 +09:00","2022-09-29",0]
["DEV",4,{"$f":"INDEX([2]KOR_StringTable!$C:$C,MATCH(D8,[2]KOR_StringTable!$B:$B,0))","v":"트로피칼 파라다이스"},"Blueprint_4","Blueprint_icon_4",4,null,"주얼",{"$f":"INDEX('NO_Table Parameter'!$G:$G,MATCH(H8,'NO_Table Parameter'!$H:$H,0))","v":4},100,"2023-03-02T05:50:10 +09:00","2022-09-29",0]

{"sheet":"Room","index":2,"n_rows":28,"n_cols":24,"rows_kept":28,"cut":false,"hidden":false,"merged":[]}
["ServiceType","Key","#RoomName","RoomName","BlueprintID","#BlueprintName","IconID","InteriorIconID","IsBase","OpenSortIndex","#BuyPriceType","BuyPriceType","BuyPriceValue","OpenGroupID","WallID","DisappearWallID","FloorID","FieldPrefabName","HouseSkinIconName","RoomConstructionTime","#RoomConstructionTime","OpenTime","#LiveDate","#UpdateVersion"]
["string","int","none","stringkey","int","none","string","string","bool","int","none","ERewardType","int","int","int[]","int[]","int[]","string","string","int","none","datetime","none","Client"]
["All","All","Client","Client","All","Client","Client","Client","Client","Client","All","All","All","All","All","All","All","Client","Client","All","All","All","Client","none"]
["서비스 타입","룸 ID","룸명","스트링 코드명","도면 ID","도면명","룸 아이콘 ID","내부 아이콘 ID","기본 룸 여부","오픈 순서","구매재화종류","구매재화종류","구매 값","오픈 조건 그룹 ID","보유 벽 ID","사라지는 벽 또는 바닥 ID","보유 바닥 ID","프리팹명","하우스 외형 아이콘명","공사 시간 (s)","시분초","오픈 시간","출시 일자","업데이트 버전"]
["DEV",1000,{"$f":"INDEX([2]KOR_StringTable!$C:$C,MATCH(D5,[2]KOR_StringTable!$B:$B,0))","v":"아담한 로열 팰리스"},"Room_1000",1,{"$f":"INDEX(Blueprint!$C:$C,MATCH(E5,Blueprint!$B:$B,0))","v":"로열 팰리스"},"Room_icon_1","1lv-room",1,1,"주얼",{"$f":"INDEX('NO_Table Parameter'!$G:$G,MATCH(K5,'NO_Table Parameter'!$H:$H,0))","v":4},10,52,"1|2|10000",null,"100|10100","Blueprint1_Room1","Blueprint1_Room1_icon",0,{"$f":"T5/(24*60*60)","v":"00:00:00"},"2023-03-02T05:50:10 +09:00","2022-09-29",0]
["DEV",1001,{"$f":"INDEX([2]KOR_StringTable!$C:$C,MATCH(D6,[2]KOR_StringTable!$B:$B,0))","v":"넓어진 로열 팰리스"},"Room_1001",1,{"$f":"INDEX(Blueprint!$C:$C,MATCH(E6,Blueprint!$B:$B,0))","v":"로열 팰리스"},"Room_icon_2","2lv-room",0,2,"주얼",{"$f":"INDEX('NO_Table Parameter'!$G:$G,MATCH(K6,'NO_Table Parameter'!$H:$H,0))","v":4},20,53,"1|2|3|10001","10000|10100","100|101|10101","Blueprint1_Room2","Blueprint1_Room2_icon",24000,"06:40:00","2023-03-02T05:50:10 +09:00","2022-09-29",0]
["DEV",1002,{"$f":"INDEX([2]KOR_StringTable!$C:$C,MATCH(D7,[2]KOR_StringTable!$B:$B,0))","v":"다락이 있는 로열 팰리스"},"Room_1002",1,{"$f":"INDEX(Blueprint!$C:$C,MATCH(E7,Blueprint!$B:$B,0))","v":"로열 팰리스"},"Room_icon_3","3lv-room",0,3,"주얼",{"$f":"INDEX('NO_Table Parameter'!$G:$G,MATCH(K7,'NO_Table Parameter'!$H:$H,0))","v":4},50,54,"1|2|3|4|5|10002","10001|10101","100|101|102|10102","Blueprint1_Room3","Blueprint1_Room3_icon",24000,"06:40:00","2023-03-02T05:50:10 +09:00","2022-09-29",0]
["DEV",1003,{"$f":"INDEX([2]KOR_StringTable!$C:$C,MATCH(D8,[2]KOR_StringTable!$B:$B,0))","v":"발코니가 넓은 로열 팰리스"},"Room_1003",1,{"$f":"INDEX(Blueprint!$C:$C,MATCH(E8,Blueprint!$B:$B,0))","v":"로열 팰리스"},"Room_icon_4","4lv-room",0,4,"주얼",{"$f":"INDEX('NO_Table Parameter'!$G:$G,MATCH(K8,'NO_Table Parameter'!$H:$H,0))","v":4},100,55,"1|2|4|5|6|7|10003","3|10002|10102","100|101|102|103|10103","Blueprint1_Room4","Blueprint1_Room4_icon",24000,"06:40:00","2023-03-02T05:50:10 +09:00","2022-09-29",0]
["DEV",1004,{"$f":"INDEX([2]KOR_StringTable!$C:$C,MATCH(D9,[2]KOR_StringTable!$B:$B,0))","v":"전망 좋은 로열 팰리스"},"Room_1004",1,{"$f":"INDEX(Blueprint!$C:$C,MATCH(E9,Blueprint!$B:$B,0))","v":"로열 팰리스"},"Room_icon_5","5lv-room",0,5,"주얼",{"$f":"INDEX('NO_Table Parameter'!$G:$G,MATCH(K9,'NO_Table Parameter'!$H:$H,0))","v":4},200,56,"1|2|5|6|7|8|9|10004","4|10003|10103","100|101|102|103|104|10104","Blueprint1_Room5","Blueprint1_Room5_icon",24000,"06:40:00","2023-03-02T05:50:10 +09:00","2022-09-29",0]
["DEV",1005,{"$f":"INDEX([2]KOR_StringTable!$C:$C,MATCH(D10,[2]KOR_StringTable!$B:$B,0))","v":"쾌적한 로열 팰리스"},"Room_1005",1,{"$f":"INDEX(Blueprint!$C:$C,MATCH(E10,Blueprint!$B:$B,0))","v":"로열 팰리스"},"Room_icon_6","6lv-room",0,6,"주얼",{"$f":"INDEX('NO_Table Parameter'!$G:$G,MATCH(K10,'NO_Table Parameter'!$H:$H,0))","v":4},500,57,"1|2|5|6|7|8|9|10","10004|10104","100|101|102|103|104|105","Blueprint1_Room6","Blueprint1_Room6_icon",24000,"06:40:00","2023-03-02T05:50:10 +09:00","2022-09-29",0]
["DEV",1006,{"$f":"INDEX([2]KOR_StringTable!$C:$C,MATCH(D11,[2]KOR_StringTable!$B:$B,0))","v":"아담한 어반 홈스테드"},"Room_1006",2,{"$f":"INDEX(Blueprint!$C:$C,MATCH(E11,Blueprint!$B:$B,0))","v":"어반 홈스테드"},"Room_icon_1","7lv-room",1,1,"주얼",{"$f":"INDEX('NO_Table Parameter'!$G:$G,MATCH(K11,'NO_Table Parameter'!$H:$H,0))","v":4},10,52,"1|2|10000",null,"100|10100","Blueprint2_Room1","Blueprint2_Room1_icon",0,"00:00:00","2023-03-02T05:50:10 +09:00","2022-09-29",0]
["DEV",1007,{"$f":"INDEX([2]KOR_StringTable!$C:$C,MATCH(D12,[2]KOR_StringTable!$B:$B,0))","v":"넓어진 어반 홈스테드"},"Room_1007",2,{"$f":"INDEX(Blueprint!$C:$C,MATCH(E12,Blueprint!$B:$B,0))","v":"어반 홈스테드"},"Room_icon_2","8lv-room",0,2,"주얼",{"$f":"INDEX('NO_Table Parameter'!$G:$G,MATCH(K12,'NO_Table Parameter'!$H:$H,0))","v":4},20,53,"1|2|3|10001","10000|10100","100|101|10101","Blueprint2_Room2","Blueprint2_Room2_icon",24000,"06:40:00","2023-03-02T05:50:10 +09:00","2022-09-29",0]
["DEV",1008,{"$f":"INDEX([2]KOR_StringTable!$C:$C,MATCH(D13,[2]KOR_StringTable!$B:$B,0))","v":"다락이 있는 어반 홈스테드"},"Room_1008",2,{"$f":"INDEX(Blueprint!$C:$C,MATCH(E13,Blueprint!$B:$B,0))","v":"어반 홈스테드"},"Room_icon_3","9lv-room",0,3,"주얼",{"$f":"INDEX('NO_Table Parameter'!$G:$G,MATCH(K13,'NO_Table Parameter'!$H:$H,0))","v":4},50,54,"1|2|3|4|5|10002","10001|10101","100|101|102|10102","Blueprint2_Room3","Blueprint2_Room3_icon",24000,"06:40:00","2023-03-02T05:50:10 +09:00","2022-09-29",0]
["DEV",1009,{"$f":"INDEX([2]KOR_StringTable!$C:$C,MATCH(D14,[2]KOR_StringTable!$B:$B,0))","v":"발코니가 넓은 어반 홈 스테드"},"Room_1009",2,{"$f":"INDEX(Blueprint!$C:$C,MATCH(E14,Blueprint!$B:$B,0))","v":"어반 홈스테드"},"Room_icon_4","10lv-room",0,4,"주얼",{"$f":"INDEX('NO_Table Parameter'!$G:$G,MATCH(K14,'NO_Table Parameter'!$H:$H,0))","v":4},100,55,"1|2|4|5|6|7|10003","3|10002|10102","100|101|102|103|10103","Blueprint2_Room4","Blueprint2_Room4_icon",24000,"06:40:00","2023-03-02T05:50:10 +09:00","2022-09-29",0]
["DEV",1010,{"$f":"INDEX([2]KOR_StringTable!$C:$C,MATCH(D15,[2]KOR_StringTable!$B:$B,0))","v":"전망 좋은 어반 홈 스테드"},"Room_1010",2,{"$f":"INDEX(Blueprint!$C:$C,MATCH(E15,Blueprint!$B:$B,0))","v":"어반 홈스테드"},"Room_icon_5","11lv-room",0,5,"주얼",{"$f":"INDEX('NO_Table Parameter'!$G:$G,MATCH(K15,'NO_Table Parameter'!$H:$H,0))","v":4},200,56,"1|2|5|6|7|8|9|10004","4|10003|10103","100|101|102|103|104|10104","Blueprint2_Room5","Blueprint2_Room5_icon",24000,"06:40:00","2023-03-02T05:50:10 +09:00","2022-09-29",0]
{"$rows_left_out":14}
{"sheet":"Yard","index":3,"n_rows":120,"n_cols":13,"rows_kept":120,"cut":false,"hidden":false,"merged":[]}
["ServiceType","Key","FieldID","#YardName","YardName","IconID","IsBase","OpenSortIndex","OpenGroupID","ConsumeMatGroupID","OpenTime","#LiveDate","#UpdateVersion"]
["string","int","int","none","stringkey","string","bool","int","int","int","datetime","none","Client"]
["All","All","All","Client","Client","Client","Client","Client","All","All","All","Client","none"]
["서비스 타입","마당 ID","구역 ID","마당명","스트링 코드명","아이콘 ID","기본 마당 여부","오픈 순서","오픈 ID","소모 재료 그룹 ID","오픈 시간","출시 일자","업데이트 버전"]
["DEV",1000000,101,{"$f":"INDEX([2]KOR_StringTable!$C:$C,MATCH(E5,[2]KOR_StringTable!$B:$B,0))","v":"로열 팰리스의 작은 가든"},"Yard_1000000","Yard_icon_1",0,1,22,10,"2023-03-02T05:50:10 +09:00","2022-09-29"]
["DEV",1000001,101,{"$f":"INDEX([2]KOR_StringTable!$C:$C,MATCH(E6,[2]KOR_StringTable!$B:$B,0))","v":"로열 팰리스의 옆뜰"},"Yard_1000001","Yard_icon_1",0,2,22,10,"2023-03-02T05:50:10 +09:00","2022-09-29"]
["DEV",1000002,101,{"$f":"INDEX([2]KOR_StringTable!$C:$C,MATCH(E7,[2]KOR_StringTable!$B:$B,0))","v":"로열 팰리스의 파티오"},"Yard_1000002","Yard_icon_1",0,3,22,10,"2023-03-02T05:50:10 +09:00","2022-09-29"]
["DEV",1000003,101,{"$f":"INDEX([2]KOR_StringTable!$C:$C,MATCH(E8,[2]KOR_StringTable!$B:$B,0))","v":"로열 팰리스의 쾌적한 가든"},"Yard_1000003","Yard_icon_1",0,4,22,10,"2023-03-02T05:50:10 +09:00","2022-09-29"]
["DEV",1000004,101,{"$f":"INDEX([2]KOR_StringTable!$C:$C,MATCH(E9,[2]KOR_StringTable!$B:$B,0))","v":"로열 팰리스의 전망 좋은 정원"},"Yard_1000004","Yard_icon_2",0,5,22,10,"2023-03-02T05:50:10 +09:00","2022-09-29"]
["DEV",1000006,101,{"$f":"INDEX([2]KOR_StringTable!$C:$C,MATCH(E10,[2]KOR_StringTable!$B:$B,0))","v":"로열 팰리스의 뒷뜰"},"Yard_1000005","Yard_icon_2",0,6,22,10,"2023-03-02T05:50:10 +09:00","2022-09-29"]
["DEV",1000007,101,{"$f":"INDEX([2]KOR_StringTable!$C:$C,MATCH(E11,[2]KOR_StringTable!$B:$B,0))","v":"로열 팰리스의 시크릿 가든"},"Yard_1000006","Yard_icon_3",0,7,22,10,"2023-03-02T05:50:10 +09:00","2022-09-29"]
["DEV",1000008,101,{"$f":"INDEX([2]KOR_StringTable!$C:$C,MATCH(E12,[2]KOR_StringTable!$B:$B,0))","v":"로열 팰리스의 잔디밭"},"Yard_1000007","Yard_icon_3",0,8,22,10,"2023-03-02T05:50:10 +09:00","2022-09-29"]
["DEV",1000009,101,{"$f":"INDEX([2]KOR_StringTable!$C:$C,MATCH(E13,[2]KOR_StringTable!$B:$B,0))","v":"로열 팰리스의 뒤뜰"},"Yard_1000008","Yard_icon_2",0,9,22,10,"2023-03-02T05:50:10 +09:00","2022-09-29"]
["DEV",1000010,101,{"$f":"INDEX([2]KOR_StringTable!$C:$C,MATCH(E14,[2]KOR_StringTable!$B:$B,0))","v":"로열 팰리스 코트야드"},"Yard_1000009","Yard_icon_2",0,10,22,10,"2023-03-02T05:50:10 +09:00","2022-09-29"]
["DEV",1000011,103,{"$f":"INDEX([2]KOR_StringTable!$C:$C,MATCH(E15,[2]KOR_StringTable!$B:$B,0))","v":"어반 홈스테드의 작은 앞뜰"},"Yard_1000010","Yard_icon_3",0,1,22,10,"2023-03-02T05:50:10 +09:00","2022-09-29"]
{"$rows_left_out":106}
{"sheet":"Field","index":4,"n_rows":23,"n_cols":22,"rows_kept":23,"cut":false,"hidden":false,"merged":[]}
["ServiceType","Key","#FieldName","FieldName","IconID","FieldImage","IsSquare","IsHouse","BGMPrefabName","NightBGMPrefabName","CityID","IsShortcut","#IconTag","IconTag","FieldPrefabName","IsShortcutPopup","#EPlaceShortcutType","PlaceShortcutType","PlaceShortcutTypeString","OpenTime","#LiveDate","#UpdateVersion"]
["string","int","none","stringkey","string","string","bool","bool","string","string","int","bool","none","int","string","bool","none","EPlaceShortcutType","string","datetime","none","Client"]
["All","All","Client","Client","Client","Client","All","All","All","All","All","All","Client","Client","Client","Client","Client","Client","Client","All","Client","none"]
["서비스 타입","구역 ID","구역명","스트링 코드명","아이콘 ID","이미지명","광장 여부","하우스 여부","BGM 프리팹명","(밤) BGM 프리팹명 ","시티 ID","지도 숏컷 표시 여부","숏컷 아이콘 표시 ","숏컷 아이콘 표시","프리팹명","숏컷 팝업 출력 여부","숏컷 장소 종류","숏컷 장소 종류","숏컷 장소 스트링","오픈 시간","출시 일자","업데이트 버전"]
["DEV",100,{"$f":"INDEX([2]KOR_StringTable!$C:$C,MATCH(D5,[2]KOR_StringTable!$B:$B,0))","v":"트로피칼 파라다이스 하우스"},"Field_100","icon_house","Field100_image",0,1,"BGM_Vacation","BGM_Vacation_N",3,0,"없음",{"$f":"INDEX('NO_Table Parameter'!$J:$J,MATCH(M5,'NO_Table Parameter'!$K:$K,0))","v":0},"Field100",1,"마이 하우스",{"$f":"IFERROR(INDEX('NO_Table Parameter'!$M:$M,MATCH(Q5,'NO_Table Parameter'!$N:$N,0)),\"\")","v":1},{"$f":"IFERROR(INDEX([2]KOR_StringTable!$B:$B,MATCH(Q5,[2]KOR_StringTable!$C:$C,0)),\"\")","v":"My_House"},"2023-03-02T05:50:10 +09:00","2022-09-29"]
["DEV",101,{"$f":"INDEX([2]KOR_StringTable!$C:$C,MATCH(D6,[2]KOR_StringTable!$B:$B,0))","v":"로열 팰리스 하우스"},"Field_101","icon_house","Field101_image",0,1,"BGM_European","BGM_European_N",2,0,"없음",{"$f":"INDEX('NO_Table Parameter'!$J:$J,MATCH(M6,'NO_Table Parameter'!$K:$K,0))","v":0},"Field101",1,"마이 하우스",{"$f":"IFERROR(INDEX('NO_Table Parameter'!$M:$M,MATCH(Q6,'NO_Table Parameter'!$N:$N,0)),\"\")","v":1},{"$f":"IFERROR(INDEX([2]KOR_StringTable!$B:$B,MATCH(Q6,[2]KOR_StringTable!$C:$C,0)),\"\")","v":"My_House"},"2023-03-02T05:50:10 +09:00","2022-09-29"]
["DEV",102,{"$f":"INDEX([2]KOR_StringTable!$C:$C,MATCH(D7,[2]KOR_StringTable!$B:$B,0))","v":"블로썸 코티지 하우스"},"Field_102","icon_house","Field102_image",0,1,"BGM_Forest","BGM_City_N",1,0,"없음",{"$f":"INDEX('NO_Table Parameter'!$J:$J,MATCH(M7,'NO_Table Parameter'!$K:$K,0))","v":0},"Field102",1,"마이 하우스",{"$f":"IFERROR(INDEX('NO_Table Parameter'!$M:$M,MATCH(Q7,'NO_Table Parameter'!$N:$N,0)),\"\")","v":1},{"$f":"IFERROR(INDEX([2]KOR_StringTable!$B:$B,MATCH(Q7,[2]KOR_StringTable!$C:$C,0)),\"\")","v":"My_House"},"2023-03-02T05:50:10 +09:00","2022-09-29"]
["DEV",103,{"$f":"INDEX([2]KOR_StringTable!$C:$C,MATCH(D8,[2]KOR_StringTable!$B:$B,0))","v":"어반 홈스테드 하우스"},"Field_103","icon_house","Field103_image",0,1,"BGM_City","BGM_City_N",4,0,"없음",{"$f":"INDEX('NO_Table Parameter'!$J:$J,MATCH(M8,'NO_Table Parameter'!$K:$K,0))","v":0},"Field103",1,"마이 하우스",{"$f":"IFERROR(INDEX('NO_Table Parameter'!$M:$M,MATCH(Q8,'NO_Table Parameter'!$N:$N,0)),\"\")","v":1},{"$f":"IFERROR(INDEX([2]KOR_StringTable!$B:$B,MATCH(Q8,[2]KOR_StringTable!$C:$C,0)),\"\")","v":"My_House"},"2023-03-02T05:50:10 +09:00","2022-09-29"]
["DEV",104,{"$f":"INDEX([2]KOR_StringTable!$C:$C,MATCH(D9,[2]KOR_StringTable!$B:$B,0))","v":"마이 가든"},"Field_104","icon_greenfarm","Field104_image",0,0,null,null,null,0,"없음",{"$f":"INDEX('NO_Table Parameter'!$J:$J,MATCH(M9,'NO_Table Parameter'!$K:$K,0))","v":0},"GreenHouseField104",0,null,{"$f":"IFERROR(INDEX('NO_Table Parameter'!$M:$M,MATCH(Q9,'NO_Table Parameter'!$N:$N,0)),\"\")","v":""},{"$f":"IFERROR(INDEX([2]KOR_StringTable!$B:$B,MATCH(Q9,[2]KOR_StringTable!$C:$C,0)),\"\")","v":""},"2023-03-02T05:50:10 +09:00","2022-09-29"]
["DEV",105,{"$f":"INDEX([2]KOR_StringTable!$C:$C,MATCH(D10,[2]KOR_StringTable!$B:$B,0))","v":"센트럴 타운"},"Field_105","icon_town2","icon_town2",1,0,"BGM_CentralTown","BGM_CentralTown_N",1,1,"없음",{"$f":"INDEX('NO_Table Parameter'!$J:$J,MATCH(M10,'NO_Table Parameter'!$K:$K,0))","v":0},"CentralTownField105",1,"만남의 공간",{"$f":"IFERROR(INDEX('NO_Table Parameter'!$M:$M,MATCH(Q10,'NO_Table Parameter'!$N:$N,0)),\"\")","v":3},{"$f":"IFERROR(INDEX([2]KOR_StringTable!$B:$B,MATCH(Q10,[2]KOR_StringTable!$C:$C,0)),\"\")","v":"Plaza"},"2023-03-02T05:50:10 +09:00","2022-09-29"]
["NONE",106,{"$f":"INDEX([2]KOR_StringTable!$C:$C,MATCH(D11,[2]KOR_StringTable!$B:$B,0))","v":"어드벤처 포레스트"},"Field_106","icon_adventure","Field106_image",1,0,"BGM_EverGreen","BGM_EverGreen_N",2,0,"없음",{"$f":"INDEX('NO_Table Parameter'!$J:$J,MATCH(M11,'NO_Table Parameter'!$K:$K,0))","v":0},"LandMark106",0,"만남의 공간",{"$f":"IFERROR(INDEX('NO_Table Parameter'!$M:$M,MATCH(Q11,'NO_Table Parameter'!$N:$N,0)),\"\")","v":3},{"$f":"IFERROR(INDEX([2]KOR_StringTable!$B:$B,MATCH(Q11,[2]KOR_StringTable!$C:$C,0)),\"\")","v":"Plaza"},"2023-03-02T05:50:10 +09:00","2022-09-29"]
["DEV",107,{"$f":"INDEX([2]KOR_StringTable!$C:$C,MATCH(D12,[2]KOR_StringTable!$B:$B,0))","v":"퀸즈 팰리스 랜드마크"},"Field_107","Field107_icon","Field107_image",1,0,"BGM_QueenPalace","BGM_QueenPalace_N",1,0,"없음",{"$f":"INDEX('NO_Table Parameter'!$J:$J,MATCH(M12,'NO_Table Parameter'!$K:$K,0))","v":0},"QueensPalaceLandMark001",0,null,{"$f":"IFERROR(INDEX('NO_Table Parameter'!$M:$M,MATCH(Q12,'NO_Table Parameter'!$N:$N,0)),\"\")","v":""},{"$f":"IFERROR(INDEX([2]KOR_StringTable!$B:$B,MATCH(Q12,[2]KOR_StringTable!$C:$C,0)),\"\")","v":""},"2023-03-02T05:50:10 +09:00","2022-09-29"]
["NONE",108,{"$f":"INDEX([2]KOR_StringTable!$C:$C,MATCH(D13,[2]KOR_StringTable!$B:$B,0))","v":"패션 스트릿"},"Field_108","icon_fashionstreet","Field108_image",1,0,"BGM_FashionStreet","BGM_FashionStreet_N",4,1,"없음",{"$f":"INDEX('NO_Table Parameter'!$J:$J,MATCH(M13,'NO_Table Parameter'!$K:$K,0))","v":0},"Field108",0,"만남의 공간",{"$f":"IFERROR(INDEX('NO_Table Parameter'!$M:$M,MATCH(Q13,'NO_Table Parameter'!$N:$N,0)),\"\")","v":3},{"$f":"IFERROR(INDEX([2]KOR_StringTable!$B:$B,MATCH(Q13,[2]KOR_StringTable!$C:$C,0)),\"\")","v":"Plaza"},"2023-03-02T05:50:10 +09:00","2022-09-29"]
["DEV",109,{"$f":"INDEX([2]KOR_StringTable!$C:$C,MATCH(D14,[2]KOR_StringTable!$B:$B,0))","v":"그리너리 시티 빌리지"},"Field_109","icon_town","Field109_image",1,0,null,null,1,0,"없음",{"$f":"INDEX('NO_Table Parameter'!$J:$J,MATCH(M14,'NO_Table Parameter'!$K:$K,0))","v":0},"Village000001",1,"마이 빌리지",{"$f":"IFERROR(INDEX('NO_Table Parameter'!$M:$M,MATCH(Q14,'NO_Table Parameter'!$N:$N,0)),\"\")","v":2},{"$f":"IFERROR(INDEX([2]KOR_StringTable!$B:$B,MATCH(Q14,[2]KOR_StringTable!$C:$C,0)),\"\")","v":"My_Village"},"2023-03-02T05:50:10 +09:00","2022-09-29"]
["DEV",110,{"$f":"INDEX([2]KOR_StringTable!$C:$C,MATCH(D15,[2]KOR_StringTable!$B:$B,0))","v":"어반뷰 시티 빌리지"},"Field_110","icon_town","Field109_image",1,0,null,null,2,0,"없음",{"$f":"INDEX('NO_Table Parameter'!$J:$J,MATCH(M15,'NO_Table Parameter'!$K:$K,0))","v":0},"Village000002",1,"마이 빌리지",{"$f":"IFERROR(INDEX('NO_Table Parameter'!$M:$M,MATCH(Q15,'NO_Table Parameter'!$N:$N,0)),\"\")","v":2},{"$f":"IFERROR(INDEX([2]KOR_StringTable!$B:$B,MATCH(Q15,[2]KOR_StringTable!$C:$C,0)),\"\")","v":"My_Village"},"2023-03-02T05:50:10 +09:00","2022-09-29"]
{"$rows_left_out":9}
{"sheet":"SaveRoom","index":5,"n_rows":20,"n_cols":12,"rows_kept":20,"cut":false,"hidden":false,"merged":[]}
["ServiceType","Key","#FieldName","FieldID","Sortindex","#BuyPriceType","BuyPriceType","BuyPriceValue","IsShow","OpenTime","#LiveDate","#UpdateVersion"]
["string","int","none","int","int","none","ERewardType","int","int","datetime","none","none"]
["All","All","Client","All","Client","All","All","All","All","All","Client","Client"]
["서비스 타입","저장룸 ID","구역명","구역 ID","순서","구매재화종류","구매재화종류","재화 값","표시 여부","오픈 시간","출시 일자","업데이트 버전"]
["DEV",1000000,"에버그린 스테이트 하우스",{"$f":"IF(ISTEXT(C5),INDEX(Field!$B$5:$B$1048576,MATCH(SaveRoom!C5,Field!$C$5:$C$1048576,0)),\"\")","v":{"$error":"#N/A"}},1,"골드",{"$f":"INDEX('NO_Table Parameter'!$G:$G,MATCH(F5,'NO_Table Parameter'!$H:$H,0))","v":1},1000000,1,"2023-03-02T05:50:10 +09:00","2022-11-10",0]
["DEV",1000001,"에버그린 스테이트 하우스",{"$f":"IF(ISTEXT(C6),INDEX(Field!$B$5:$B$1048576,MATCH(SaveRoom!C6,Field!$C$5:$C$1048576,0)),\"\")","v":{"$error":"#N/A"}},2,"주얼",{"$f":"INDEX('NO_Table Parameter'!$G:$G,MATCH(F6,'NO_Table Parameter'!$H:$H,0))","v":4},100,1,"2023-03-02T05:50:10 +09:00","2022-11-10",0]
["DEV",1000002,"에버그린 스테이트 하우스",{"$f":"IF(ISTEXT(C7),INDEX(Field!$B$5:$B$1048576,MATCH(SaveRoom!C7,Field!$C$5:$C$1048576,0)),\"\")","v":{"$error":"#N/A"}},3,"주얼",{"$f":"INDEX('NO_Table Parameter'!$G:$G,MATCH(F7,'NO_Table Parameter'!$H:$H,0))","v":4},100,1,"2023-03-02T05:50:10 +09:00","2022-11-10",0]
["DEV",1000003,"에버그린 스테이트 하우스",{"$f":"IF(ISTEXT(C8),INDEX(Field!$B$5:$B$1048576,MATCH(SaveRoom!C8,Field!$C$5:$C$1048576,0)),\"\")","v":{"$error":"#N/A"}},4,"주얼",{"$f":"INDEX('NO_Table Parameter'!$G:$G,MATCH(F8,'NO_Table Parameter'!$H:$H,0))","v":4},100,1,"2023-03-02T05:50:10 +09:00","2022-11-10",0]
["DEV",1000004,"어반뷰 스테이트 하우스",{"$f":"IF(ISTEXT(C9),INDEX(Field!$B$5:$B$1048576,MATCH(SaveRoom!C9,Field!$C$5:$C$1048576,0)),\"\")","v":{"$error":"#N/A"}},1,"골드",{"$f":"INDEX('NO_Table Parameter'!$G:$G,MATCH(F9,'NO_Table Parameter'!$H:$H,0))","v":1},1000000,1,"2023-03-02T05:50:10 +09:00","2022-11-10",0]
["DEV",1000005,"어반뷰 스테이트 하우스",{"$f":"IF(ISTEXT(C10),INDEX(Field!$B$5:$B$1048576,MATCH(SaveRoom!C10,Field!$C$5:$C$1048576,0)),\"\")","v":{"$error":"#N/A"}},2,"주얼",{"$f":"INDEX('NO_Table Parameter'!$G:$G,MATCH(F10,'NO_Table Parameter'!$H:$H,0))","v":4},100,1,"2023-03-02T05:50:10 +09:00","2022-11-10",0]
["DEV",1000006,"어반뷰 스테이트 하우스",{"$f":"IF(ISTEXT(C11),INDEX(Field!$B$5:$B$1048576,MATCH(SaveRoom!C11,Field!$C$5:$C$1048576,0)),\"\")","v":{"$error":"#N/A"}},3,"주얼",{"$f":"INDEX('NO_Table Parameter'!$G:$G,MATCH(F11,'NO_Table Parameter'!$H:$H,0))","v":4},100,1,"2023-03-02T05:50:10 +09:00","2022-11-10",0]
["DEV",1000007,"어반뷰 스테이트 하우스",{"$f":"IF(ISTEXT(C12),INDEX(Field!$B$5:$B$1048576,MATCH(SaveRoom!C12,Field!$C$5:$C$1048576,0)),\"\")","v":{"$error":"#N/A"}},4,"주얼",{"$f":"INDEX('NO_Table Parameter'!$G:$G,MATCH(F12,'NO_Table Parameter'!$H:$H,0))","v":4},100,1,"2023-03-02T05:50:10 +09:00","2022-11-10",0]
["DEV",1000008,"퀸즈 팰리스 스테이트 하우스",{"$f":"IF(ISTEXT(C13),INDEX(Field!$B$5:$B$1048576,MATCH(SaveRoom!C13,Field!$C$5:$C$1048576,0)),\"\")","v":{"$error":"#N/A"}},1,"골드",{"$f":"INDEX('NO_Table Parameter'!$G:$G,MATCH(F13,'NO_Table Parameter'!$H:$H,0))","v":1},1000000,1,"2023-03-02T05:50:10 +09:00","2022-11-10",0]
["DEV",1000009,"퀸즈 팰리스 스테이트 하우스",{"$f":"IF(ISTEXT(C14),INDEX(Field!$B$5:$B$1048576,MATCH(SaveRoom!C14,Field!$C$5:$C$1048576,0)),\"\")","v":{"$error":"#N/A"}},2,"주얼",{"$f":"INDEX('NO_Table Parameter'!$G:$G,MATCH(F14,'NO_Table Parameter'!$H:$H,0))","v":4},100,1,"2023-03-02T05:50:10 +09:00","2022-11-10",0]
["DEV",1000010,"퀸즈 팰리스 스테이트 하우스",{"$f":"IF(ISTEXT(C15),INDEX(Field!$B$5:$B$1048576,MATCH(SaveRoom!C15,Field!$C$5:$C$1048576,0)),\"\")","v":{"$error":"#N/A"}},3,"주얼",{"$f":"INDEX('NO_Table Parameter'!$G:$G,MATCH(F15,'NO_Table Parameter'!$H:$H,0))","v":4},100,1,"2023-03-02T05:50:10 +09:00","2022-11-10",0]
{"$rows_left_out":5}