{"text_format":"1","workbook":"xlsx","n_sheets":7,"sheets":["NO_TableParameter","Plaza","Central_NPCSpawn","Central_CraftingToolSkin","Plaza_SpawnPoint","Plaza_ExchangeItem","NO_참조테이블"],"not_rendered":{"charts":0,"images":0,"macros":0,"external_links":3,"defined_names":0,"comments":0,"pivot_tables":0},"unopened":[],"bounds":{"document_bytes":16777216,"sheet_cells":100000,"rows_first":2000,"rows_last":500,"rows_between":2000,"halvings":0,"cell_chars":16384,"cell_head_chars":4096},"cells_cut":0,"cells_raw":0,"read":"whole","date_system":"1900"}

{"sheet":"NO_TableParameter","index":0,"n_rows":13,"n_cols":8,"rows_kept":13,"cut":false,"hidden":false,"merged":[]}
["PlazaTable",null,null,null,null,null,"[PF_EnumTypeData.xlsm]EPlazaType!Key","[PF_EnumTypeData.xlsm]EPlazaType!Desc"]
["칼럼 영문명","자료형","칼럼 한글명","설명",null,null,"열거형 숫자","요약"]
["ServiceType","string","서비스 타입",null,null,null,1,"벌목 랜드마크"]
["Key","int","플라자 ID",null,null,null,2,"빌리지"]
["#FieldName","none","구역명",null,null,null,3,"센트럴타운"]
["FieldID","int","구역 ID",null,null,null,4,"일반 랜드마크"]
["#PlazaType","none","플라자 종류"]
["PlazaType","EPlazaType","플라자 종류"]
["PlazaAddress","int","플라자 주소","PlazaAddress Key값 입력"]
["#FieldDesc","none","구역 설명 텍스트"]
["FieldDesc","stringkey","구역 설명 텍스트","팝업창에 출력되는 스크립트"]
["IsPlazaPopup","bool","플라자 팝업"]
["PlazaImage","string","이미지명","팝업창에 출력되는 이미지"]

{"sheet":"Plaza","index":1,"n_rows":12,"n_cols":16,"rows_kept":12,"cut":false,"hidden":false,"merged":[]}
["ServiceType","Key","#FieldName","FieldName","FieldID","#PlazaType","PlazaType","PlazaAddress","#FieldDesc","FieldDesc","IsPlazaPopup","PlazaImage","Sortindex"]
["string","int","none","stringkey","int","none","EPlazaType","int","none","stringkey","bool","string","int"]
["All","All","Client","All","All","Client","All","All","Client","All","Client","Client","Client"]
["서비스 타입","플라자 ID","구역명","필드명","구역 ID","구역명","플라자 종류","플라자 주소 ID","구역 설명 텍스트","구역 설명 텍스트","플라자 팝업","이미지명","순서"]
["NONE",1,"패션 스트릿",{"$f":"INDEX([2]KOR_StringTable!$B:$B,MATCH(C5,[2]KOR_StringTable!$C:$C,0))","v":"Zone_104"},{"$f":"INDEX(NO_참조테이블!$E:$E,MATCH(C5,NO_참조테이블!$F:$F,0))","v":108},"일반 랜드마크",{"$f":"INDEX(NO_참조테이블!$N:$N,MATCH(Plaza!F5,NO_참조테이블!$O:$O,0))","v":4},1,"나만의 패션 스타일을 뽐내봐!",{"$f":"INDEX([2]KOR_StringTable!$B:$B,MATCH(I5,[2]KOR_StringTable!$C:$C,0))","v":"Zone_104_Desc"},0,"Plaza1_image",1]
["NONE",2,"어드벤처 포레스트",{"$f":"INDEX([2]KOR_StringTable!$B:$B,MATCH(C6,[2]KOR_StringTable!$C:$C,0))","v":"Field_106"},{"$f":"INDEX(NO_참조테이블!$E:$E,MATCH(C6,NO_참조테이블!$F:$F,0))","v":106},"일반 랜드마크",{"$f":"INDEX(NO_참조테이블!$N:$N,MATCH(Plaza!F6,NO_참조테이블!$O:$O,0))","v":4},2,"친구들과 벌목을 할 수 있어요!",{"$f":"INDEX([2]KOR_StringTable!$B:$B,MATCH(I6,[2]KOR_StringTable!$C:$C,0))","v":"Field_106_Desc"},0,"Plaza2_image",2]
["DEV",3,"센트럴 타운",{"$f":"INDEX([2]KOR_StringTable!$B:$B,MATCH(C7,[2]KOR_StringTable!$C:$C,0))","v":"Field_105"},{"$f":"INDEX(NO_참조테이블!$E:$E,MATCH(C7,NO_참조테이블!$F:$F,0))","v":105},"센트럴타운",{"$f":"INDEX(NO_참조테이블!$N:$N,MATCH(Plaza!F7,NO_참조테이블!$O:$O,0))","v":3},3,"사랑스러운 주민들이 옹기종기 모여있는 곳",{"$f":"INDEX([2]KOR_StringTable!$B:$B,MATCH(I7,[2]KOR_StringTable!$C:$C,0))","v":"Field105_Desc"},0,"Plaza3_image",3]
["DEV",4,"패션 스퀘어",{"$f":"INDEX([2]KOR_StringTable!$B:$B,MATCH(C8,[2]KOR_StringTable!$C:$C,0))","v":"field_2001"},{"$f":"INDEX(NO_참조테이블!$E:$E,MATCH(C8,NO_참조테이블!$F:$F,0))","v":2001},"패션 스퀘어",{"$f":"INDEX(NO_참조테이블!$N:$N,MATCH(Plaza!F8,NO_참조테이블!$O:$O,0))","v":5},1,"나만의 패션 스타일을 뽐내봐!",{"$f":"INDEX([2]KOR_StringTable!$B:$B,MATCH(I8,[2]KOR_StringTable!$C:$C,0))","v":"Zone_104_Desc"},1,"Plaza4_image",1]
["DEV",5,"시나모롤 스퀘어",{"$f":"INDEX([2]KOR_StringTable!$B:$B,MATCH(C9,[2]KOR_StringTable!$C:$C,0))","v":"Field_2003"},{"$f":"INDEX(NO_참조테이블!$E:$E,MATCH(C9,NO_참조테이블!$F:$F,0))","v":2003},"일반 랜드마크",{"$f":"INDEX(NO_참조테이블!$N:$N,MATCH(Plaza!F9,NO_참조테이블!$O:$O,0))","v":4},5,"시나모롤을 만나러 가봐요!",{"$f":"INDEX([2]KOR_StringTable!$B:$B,MATCH(I9,[2]KOR_StringTable!$C:$C,0))","v":"Field_2003_Desc"},1,"Plaza5_image",4]
["DEV",6,"플레이 스퀘어",{"$f":"INDEX([2]KOR_StringTable!$B:$B,MATCH(C10,[2]KOR_StringTable!$C:$C,0))","v":"Field_2005"},{"$f":"INDEX(NO_참조테이블!$E:$E,MATCH(C10,NO_참조테이블!$F:$F,0))","v":2005},"일반 랜드마크",{"$f":"INDEX(NO_참조테이블!$N:$N,MATCH(Plaza!F10,NO_참조테이블!$O:$O,0))","v":4},6,"시나모롤을 만나러 가봐요!",{"$f":"INDEX([2]KOR_StringTable!$B:$B,MATCH(I10,[2]KOR_StringTable!$C:$C,0))","v":"Field_2003_Desc"},1,"Plaza5_image",5]
["DEV",7,"시나모롤 하우스",{"$f":"INDEX([2]KOR_StringTable!$B:$B,MATCH(C11,[2]KOR_StringTable!$C:$C,0))","v":"Field_2006"},{"$f":"INDEX(NO_참조테이블!$E:$E,MATCH(C11,NO_참조테이블!$F:$F,0))","v":2006},"일반 랜드마크",{"$f":"INDEX(NO_참조테이블!$N:$N,MATCH(Plaza!F11,NO_참조테이블!$O:$O,0))","v":4},6,"시나모롤을 만나러 가봐요!",{"$f":"INDEX([2]KOR_StringTable!$B:$B,MATCH(I11,[2]KOR_StringTable!$C:$C,0))","v":"Field_2003_Desc"},0,"Plaza5_image",1]
[null,null,null,null,null,null,null,null,null,null,null,null,null,null,null,"S"]

{"sheet":"Central_NPCSpawn","index":2,"n_rows":30,"n_cols":28,"rows_kept":30,"cut":false,"hidden":false,"merged":[]}
["ServiceType","Key","PlazaID","#PlazaType","PlazaType","#NPCName","NPCID","BGName","IsMonOut","IsTueOut","IsWedOut","IsThuOut","IsFriOut","IsSatOut","IsSunOut","IsMonIn","IsTueIn","IsWedIn","IsThuIn","IsFriIn","IsSatIn","IsSunIn","XCoord","YCoord","EventStartTime","EventEndTime","#LiveDate","#UpdateVersion"]
["string","int","int","none","EPlazaType","none","int","string","bool","bool","bool","bool","bool","bool","bool","bool","bool","bool","bool","bool","bool","bool","int","int","datetime","datetime","none","none"]
["All","All","All","Client","All","Client","All","Client","All","All","All","All","All","All","All","All","All","All","All","All","All","All","Client","Client","All","All","Client","Client"]
["서비스 타입","플라자 NPC ID","플라자 ID","구역명","플라자 종류","#NPC명","NPC ID","컷신 배경 스프라이트명","월요일","화요일","수요일","목요일","금요일","토요일","일요일","월요일 집","화요일 집","수요일 집","목요일 집","금요일 집","토요일 집","일요일 집","X 좌표","Y좌표","이벤트 시작 시간","이벤트 종료 시간","출시 일자","업데이트 버전"]
["DEV",1,1,"센트럴타운",{"$f":"INDEX(NO_참조테이블!$N:$N,MATCH(D5,NO_참조테이블!$O:$O,0))","v":3},"이브",{"$f":"INDEX(NO_참조테이블!$H:$H,MATCH(Central_NPCSpawn!F5,NO_참조테이블!$I:$I,0))","v":1},"villagebg_1",1,1,1,1,1,1,1,0,0,0,0,0,0,0,null,null,null,null,"2022-11-10",0]
["DEV",2,1,"센트럴타운",{"$f":"INDEX(NO_참조테이블!$N:$N,MATCH(D6,NO_참조테이블!$O:$O,0))","v":3},"토리",{"$f":"INDEX(NO_참조테이블!$H:$H,MATCH(Central_NPCSpawn!F6,NO_참조테이블!$I:$I,0))","v":2},"villagebg_1",0,0,0,0,0,0,0,0,0,0,0,0,0,0,null,null,null,null,"2022-11-10",0]
["DEV",3,1,"센트럴타운",{"$f":"INDEX(NO_참조테이블!$N:$N,MATCH(D7,NO_참조테이블!$O:$O,0))","v":3},"조이",{"$f":"INDEX(NO_참조테이블!$H:$H,MATCH(Central_NPCSpawn!F7,NO_참조테이블!$I:$I,0))","v":3},"villagebg_1",0,0,0,0,0,0,0,0,0,0,0,0,0,0,-32,27,null,null,"2022-11-10",0]
["DEV",4,1,"센트럴타운",{"$f":"INDEX(NO_참조테이블!$N:$N,MATCH(D8,NO_참조테이블!$O:$O,0))","v":3},"덕키",{"$f":"INDEX(NO_참조테이블!$H:$H,MATCH(Central_NPCSpawn!F8,NO_참조테이블!$I:$I,0))","v":4},"villagebg_1",0,0,0,0,0,0,0,0,0,0,0,0,0,0,-32,3,null,null,"2022-11-10",0]
["DEV",5,1,"센트럴타운",{"$f":"INDEX(NO_참조테이블!$N:$N,MATCH(D9,NO_참조테이블!$O:$O,0))","v":3},"피터",{"$f":"INDEX(NO_참조테이블!$H:$H,MATCH(Central_NPCSpawn!F9,NO_참조테이블!$I:$I,0))","v":5},"villagebg_1",0,0,0,0,0,0,0,0,0,0,0,0,0,0,-32,-20,null,null,"2022-11-10",0]
["DEV",6,1,"센트럴타운",{"$f":"INDEX(NO_참조테이블!$N:$N,MATCH(D10,NO_참조테이블!$O:$O,0))","v":3},"파커",{"$f":"INDEX(NO_참조테이블!$H:$H,MATCH(Central_NPCSpawn!F10,NO_참조테이블!$I:$I,0))","v":6},"villagebg_1",1,1,1,1,1,1,1,0,0,0,0,0,0,0,-32,-32,null,null,"2022-11-10",0]
["DEV",7,1,"센트럴타운",{"$f":"INDEX(NO_참조테이블!$N:$N,MATCH(D11,NO_참조테이블!$O:$O,0))","v":3},"테오",{"$f":"INDEX(NO_참조테이블!$H:$H,MATCH(Central_NPCSpawn!F11,NO_참조테이블!$I:$I,0))","v":7},"villagebg_1",0,0,0,0,0,0,0,0,0,0,0,0,0,0,4,-46,null,null,"2022-11-10",0]
["DEV",8,1,"센트럴타운",{"$f":"INDEX(NO_참조테이블!$N:$N,MATCH(D12,NO_참조테이블!$O:$O,0))","v":3},"올리버",{"$f":"INDEX(NO_참조테이블!$H:$H,MATCH(Central_NPCSpawn!F12,NO_참조테이블!$I:$I,0))","v":8},"villagebg_1",0,0,0,0,0,0,0,0,0,0,0,0,0,0,17,-46,null,null,"2022-11-10",0]
["DEV",9,1,"센트럴타운",{"$f":"INDEX(NO_참조테이블!$N:$N,MATCH(D13,NO_참조테이블!$O:$O,0))","v":3},"루비",{"$f":"INDEX(NO_참조테이블!$H:$H,MATCH(Central_NPCSpawn!F13,NO_참조테이블!$I:$I,0))","v":9},"villagebg_1",0,0,0,0,0,0,0,0,0,0,0,0,0,0,18,-31,null,null,"2022-11-10",0]
["DEV",10,1,"센트럴타운",{"$f":"INDEX(NO_참조테이블!$N:$N,MATCH(D14,NO_참조테이블!$O:$O,0))","v":3},"미아",{"$f":"INDEX(NO_참조테이블!$H:$H,MATCH(Central_NPCSpawn!F14,NO_참조테이블!$I:$I,0))","v":10},"villagebg_1",1,1,1,1,1,1,1,0,0,0,0,0,0,0,4,-31,null,null,"2022-11-10",0]
["DEV",11,1,"센트럴타운",{"$f":"INDEX(NO_참조테이블!$N:$N,MATCH(D15,NO_참조테이블!$O:$O,0))","v":3},"리아",{"$f":"INDEX(NO_참조테이블!$H:$H,MATCH(Central_NPCSpawn!F15,NO_참조테이블!$I:$I,0))","v":11},"villagebg_1",1,1,1,1,1,1,1,0,0,0,0,0,0,0,-5,-5,null,null,"2022-11-10",0]
["DEV",12,1,"센트럴타운",{"$f":"INDEX(NO_참조테이블!$N:$N,MATCH(D16,NO_참조테이블!$O:$O,0))","v":3},"콜",{"$f":"INDEX(NO_참조테이블!$H:$H,MATCH(Central_NPCSpawn!F16,NO_참조테이블!$I:$I,0))","v":12},"villagebg_1",1,1,1,1,1,1,1,0,0,0,0,0,0,0,-5,-5,null,null,"2022-11-10",0]
["DEV",13,1,"센트럴타운",{"$f":"INDEX(NO_참조테이블!$N:$N,MATCH(D17,NO_참조테이블!$O:$O,0))","v":3},"이안",{"$f":"INDEX(NO_참조테이블!$H:$H,MATCH(Central_NPCSpawn!F17,NO_참조테이블!$I:$I,0))","v":13},"villagebg_1",1,1,1,1,1,1,1,0,0,0,0,0,0,0,-5,-5,null,null,"2022-11-10",0]
["DEV",14,1,"센트럴타운",{"$f":"INDEX(NO_참조테이블!$N:$N,MATCH(D18,NO_참조테이블!$O:$O,0))","v":3},"로지",{"$f":"INDEX(NO_참조테이블!$H:$H,MATCH(Central_NPCSpawn!F18,NO_참조테이블!$I:$I,0))","v":14},"villagebg_1",0,0,0,0,0,0,0,0,0,0,0,0,0,0,-5,-5,null,null,"2022-11-10",0]
["DEV",15,1,"센트럴타운",{"$f":"INDEX(NO_참조테이블!$N:$N,MATCH(D19,NO_참조테이블!$O:$O,0))","v":3},"버기",{"$f":"INDEX(NO_참조테이블!$H:$H,MATCH(Central_NPCSpawn!F19,NO_참조테이블!$I:$I,0))","v":15},"villagebg_1",0,0,0,0,0,0,0,0,0,0,0,0,0,0,-5,-5,null,null,"2022-11-10",0]
["DEV",16,1,"센트럴타운",{"$f":"INDEX(NO_참조테이블!$N:$N,MATCH(D20,NO_참조테이블!$O:$O,0))","v":3},"올리버의 직원",{"$f":"INDEX(NO_참조테이블!$H:$H,MATCH(Central_NPCSpawn!F20,NO_참조테이블!$I:$I,0))","v":16},"villagebg_1",0,0,0,0,0,0,0,0,0,0,0,0,0,0,-5,-5,null,null,"2022-11-10",0]
["DEV",17,1,"센트럴타운",{"$f":"INDEX(NO_참조테이블!$N:$N,MATCH(D21,NO_참조테이블!$O:$O,0))","v":3},"이벤트 NPC",{"$f":"INDEX(NO_참조테이블!$H:$H,MATCH(Central_NPCSpawn!F21,NO_참조테이블!$I:$I,0))","v":17},"villagebg_1",0,0,0,0,0,0,0,0,0,0,0,0,0,0,-5,-5,null,null,"2022-11-10",0]
["DEV",18,4,"패션 스퀘어",{"$f":"INDEX(NO_참조테이블!$N:$N,MATCH(D22,NO_참조테이블!$O:$O,0))","v":5},"쿠로미",{"$f":"INDEX(NO_참조테이블!$H:$H,MATCH(Central_NPCSpawn!F22,NO_참조테이블!$I:$I,0))","v":2001},"villagebg_1",1,1,1,1,1,1,1,0,0,0,0,0,0,0,-32,-32,null,null,"2022-11-10",0]
["DEV",19,4,"패션 스퀘어",{"$f":"INDEX(NO_참조테이블!$N:$N,MATCH(D23,NO_참조테이블!$O:$O,0))","v":5},"마이 멜로디",{"$f":"INDEX(NO_참조테이블!$H:$H,MATCH(Central_NPCSpawn!F23,NO_참조테이블!$I:$I,0))","v":2002},"villagebg_1",1,1,1,1,1,1,1,0,0,0,0,0,0,0,4,-46,null,null,"2022-11-10",0]
["DEV",20,6,"플레이 스퀘어",{"$f":"INDEX(NO_참조테이블!$N:$N,MATCH(D24,NO_참조테이블!$O:$O,0))","v":7},"포차코",{"$f":"INDEX(NO_참조테이블!$H:$H,MATCH(Central_NPCSpawn!F24,NO_참조테이블!$I:$I,0))","v":3001},"villagebg_1",1,1,1,1,1,1,1,0,0,0,0,0,0,0,-32,5,null,null,"2022-11-10",0]
["DEV",21,6,"플레이 스퀘어",{"$f":"INDEX(NO_참조테이블!$N:$N,MATCH(D25,NO_참조테이블!$O:$O,0))","v":7},"한교동",{"$f":"INDEX(NO_참조테이블!$H:$H,MATCH(Central_NPCSpawn!F25,NO_참조테이블!$I:$I,0))","v":3002},"villagebg_1",1,1,1,1,1,1,1,0,0,0,0,0,0,0,-32,10,null,null,"2022-11-10",0]
["DEV",22,6,"플레이 스퀘어",{"$f":"INDEX(NO_참조테이블!$N:$N,MATCH(D26,NO_참조테이블!$O:$O,0))","v":7},"아히루노페클",{"$f":"INDEX(NO_참조테이블!$H:$H,MATCH(Central_NPCSpawn!F26,NO_참조테이블!$I:$I,0))","v":3005},"villagebg_1",1,1,1,1,1,1,1,0,0,0,0,0,0,0,-32,27,null,null,"2022-11-10",0]
["DEV",23,6,"플레이 스퀘어",{"$f":"INDEX(NO_참조테이블!$N:$N,MATCH(D27,NO_참조테이블!$O:$O,0))","v":7},"턱시도샘",{"$f":"INDEX(NO_참조테이블!$H:$H,MATCH(Central_NPCSpawn!F27,NO_참조테이블!$I:$I,0))","v":3006},"villagebg_1",1,1,1,1,1,1,1,0,0,0,0,0,0,0,-32,3,null,null,"2022-11-10",0]
["DEV",24,6,"플레이 스퀘어",{"$f":"INDEX(NO_참조테이블!$N:$N,MATCH(D28,NO_참조테이블!$O:$O,0))","v":7},"케로케로케로피",{"$f":"INDEX(NO_참조테이블!$H:$H,MATCH(Central_NPCSpawn!F28,NO_참조테이블!$I:$I,0))","v":3003},"villagebg_1",1,1,1,1,1,1,1,0,0,0,0,0,0,0,-32,-20,null,null,"2022-11-10",0]
["DEV",25,6,"플레이 스퀘어",{"$f":"INDEX(NO_참조테이블!$N:$N,MATCH(D29,NO_참조테이블!$O:$O,0))","v":7},"배드바츠마루",{"$f":"INDEX(NO_참조테이블!$H:$H,MATCH(Central_NPCSpawn!F29,NO_참조테이블!$I:$I,0))","v":3004},"villagebg_1",1,1,1,1,1,1,1,0,0,0,0,0,0,0,-32,-32,null,null,"2022-11-10",0]
["DEV",26,5,"시나모롤 스퀘어",{"$f":"INDEX(NO_참조테이블!$N:$N,MATCH(D30,NO_참조테이블!$O:$O,0))","v":6},"시나모롤",{"$f":"INDEX(NO_참조테이블!$H:$H,MATCH(Central_NPCSpawn!F30,NO_참조테이블!$I:$I,0))","v":1002},"villagebg_1",1,1,1,1,1,1,1,0,0,0,0,0,0,0,2,22,null,null,"2022-11-10",0]

{"sheet":"Central_CraftingToolSkin","index":3,"n_rows":5,"n_cols":6,"rows_kept":5,"cut":false,"hidden":false,"merged":[]}
["ServiceType","Key","PlazaKey","SpawnPointID","SpawnCraftingToolGroup","CraftingType"]
["string","int","int","int","int","ECraftingType"]
["All","All","Client","Client","Client","Client"]
["서비스 타입"]
["DEV",1,3,126,3,8]

{"sheet":"Plaza_SpawnPoint","index":4,"n_rows":249,"n_cols":5,"rows_kept":249,"cut":false,"hidden":false,"merged":[]}
["ServiceType","Key","#FieldName","FieldID","IsReverse"]
["string","int","none","int","bool"]
["All","All","Client","Client","Client"]
["서비스 타입","플라자 스폰 zone","구역명","필드 ID","회전 여부"]
["DEV",1,"센트럴 타운",{"$f":"INDEX(NO_참조테이블!$E:$E,MATCH(Plaza_SpawnPoint!C5,NO_참조테이블!$F:$F,0))","v":105},0]
["DEV",2,"센트럴 타운",{"$f":"INDEX(NO_참조테이블!$E:$E,MATCH(Plaza_SpawnPoint!C6,NO_참조테이블!$F:$F,0))","v":105},0]
["DEV",3,"센트럴 타운",{"$f":"INDEX(NO_참조테이블!$E:$E,MATCH(Plaza_SpawnPoint!C7,NO_참조테이블!$F:$F,0))","v":105},0]
["DEV",4,"센트럴 타운",{"$f":"INDEX(NO_참조테이블!$E:$E,MATCH(Plaza_SpawnPoint!C8,NO_참조테이블!$F:$F,0))","v":105},0]
["DEV",5,"센트럴 타운",{"$f":"INDEX(NO_참조테이블!$E:$E,MATCH(Plaza_SpawnPoint!C9,NO_참조테이블!$F:$F,0))","v":105},0]
["DEV",6,"센트럴 타운",{"$f":"INDEX(NO_참조테이블!$E:$E,MATCH(Plaza_SpawnPoint!C10,NO_참조테이블!$F:$F,0))","v":105},0]
["DEV",7,"센트럴 타운",{"$f":"INDEX(NO_참조테이블!$E:$E,MATCH(Plaza_SpawnPoint!C11,NO_참조테이블!$F:$F,0))","v":105},1]
["DEV",8,"센트럴 타운",{"$f":"INDEX(NO_참조테이블!$E:$E,MATCH(Plaza_SpawnPoint!C12,NO_참조테이블!$F:$F,0))","v":105},1]
["DEV",9,"센트럴 타운",{"$f":"INDEX(NO_참조테이블!$E:$E,MATCH(Plaza_SpawnPoint!C13,NO_참조테이블!$F:$F,0))","v":105},1]
["DEV",10,"그리너리 시티 빌리지",{"$f":"INDEX(NO_참조테이블!$E:$E,MATCH(Plaza_SpawnPoint!C14,NO_참조테이블!$F:$F,0))","v":109},0]
["DEV",11,"그리너리 시티 빌리지",{"$f":"INDEX(NO_참조테이블!$E:$E,MATCH(Plaza_SpawnPoint!C15,NO_참조테이블!$F:$F,0))","v":109},0]
["DEV",12,"그리너리 시티 빌리지",{"$f":"INDEX(NO_참조테이블!$E:$E,MATCH(Plaza_SpawnPoint!C16,NO_참조테이블!$F:$F,0))","v":109},0]
["DEV",13,"그리너리 시티 빌리지",{"$f":"INDEX(NO_참조테이블!$E:$E,MATCH(Plaza_SpawnPoint!C17,NO_참조테이블!$F:$F,0))","v":109},0]
["DEV",14,"그리너리 시티 빌리지",{"$f":"INDEX(NO_참조테이블!$E:$E,MATCH(Plaza_SpawnPoint!C18,NO_참조테이블!$F:$F,0))","v":109},0]
["DEV",15,"그리너리 시티 빌리지",{"$f":"INDEX(NO_참조테이블!$E:$E,MATCH(Plaza_SpawnPoint!C19,NO_참조테이블!$F:$F,0))","v":109},0]
["DEV",16,"그리너리 시티 빌리지",{"$f":"INDEX(NO_참조테이블!$E:$E,MATCH(Plaza_SpawnPoint!C20,NO_참조테이블!$F:$F,0))","v":109},1]
["DEV",17,"그리너리 시티 빌리지",{"$f":"INDEX(NO_참조테이블!$E:$E,MATCH(Plaza_SpawnPoint!C21,NO_참조테이블!$F:$F,0))","v":109},1]
["DEV",18,"그리너리 시티 빌리지",{"$f":"INDEX(NO_참조테이블!$E:$E,MATCH(Plaza_SpawnPoint!C22,NO_참조테이블!$F:$F,0))","v":109},1]
["DEV",19,"그리너리 시티 빌리지",{"$f":"INDEX(NO_참조테이블!$E:$E,MATCH(Plaza_SpawnPoint!C23,NO_참조테이블!$F:$F,0))","v":109},1]
["DEV",20,"그리너리 시티 빌리지",{"$f":"INDEX(NO_참조테이블!$E:$E,MATCH(Plaza_SpawnPoint!C24,NO_참조테이블!$F:$F,0))","v":109},1]
["DEV",21,"그리너리 시티 빌리지",{"$f":"INDEX(NO_참조테이블!$E:$E,MATCH(Plaza_SpawnPoint!C25,NO_참조테이블!$F:$F,0))","v":109},0]
["DEV",22,"그리너리 시티 빌리지",{"$f":"INDEX(NO_참조테이블!$E:$E,MATCH(Plaza_SpawnPoint!C26,NO_참조테이블!$F:$F,0))","v":109},0]
["DEV",23,"그리너리 시티 빌리지",{"$f":"INDEX(NO_참조테이블!$E:$E,MATCH(Plaza_SpawnPoint!C27,NO_참조테이블!$F:$F,0))","v":109},0]
["DEV",24,"그리너리 시티 빌리지",{"$f":"INDEX(NO_참조테이블!$E:$E,MATCH(Plaza_SpawnPoint!C28,NO_참조테이블!$F:$F,0))","v":109},0]
["DEV",25,"그리너리 시티 빌리지",{"$f":"INDEX(NO_참조테이블!$E:$E,MATCH(Plaza_SpawnPoint!C29,NO_참조테이블!$F:$F,0))","v":109},0]
["DEV",26,"그리너리 시티 빌리지",{"$f":"INDEX(NO_참조테이블!$E:$E,MATCH(Plaza_SpawnPoint!C30,NO_참조테이블!$F:$F,0))","v":109},0]
["DEV",27,"그리너리 시티 빌리지",{"$f":"INDEX(NO_참조테이블!$E:$E,MATCH(Plaza_SpawnPoint!C31,NO_참조테이블!$F:$F,0))","v":109},0]
["DEV",28,"그리너리 시티 빌리지",{"$f":"INDEX(NO_참조테이블!$E:$E,MATCH(Plaza_SpawnPoint!C32,NO_참조테이블!$F:$F,0))","v":109},1]
["DEV",29,"그리너리 시티 빌리지",{"$f":"INDEX(NO_참조테이블!$E:$E,MATCH(Plaza_SpawnPoint!C33,NO_참조테이블!$F:$F,0))","v":109},1]
["DEV",30,"그리너리 시티 빌리지",{"$f":"INDEX(NO_참조테이블!$E:$E,MATCH(Plaza_SpawnPoint!C34,NO_참조테이블!$F:$F,0))","v":109},1]
["DEV",31,"그리너리 시티 빌리지",{"$f":"INDEX(NO_참조테이블!$E:$E,MATCH(Plaza_SpawnPoint!C35,NO_참조테이블!$F:$F,0))","v":109},1]
["DEV",32,"그리너리 시티 빌리지",{"$f":"INDEX(NO_참조테이블!$E:$E,MATCH(Plaza_SpawnPoint!C36,NO_참조테이블!$F:$F,0))","v":109},1]
["DEV",33,"그리너리 시티 빌리지",{"$f":"INDEX(NO_참조테이블!$E:$E,MATCH(Plaza_SpawnPoint!C37,NO_참조테이블!$F:$F,0))","v":109},1]
["DEV",34,"그리너리 시티 빌리지",{"$f":"INDEX(NO_참조테이블!$E:$E,MATCH(Plaza_SpawnPoint!C38,NO_참조테이블!$F:$F,0))","v":109},1]
["DEV",35,"퀸즈 팰리스 시티 빌리지",{"$f":"INDEX(NO_참조테이블!$E:$E,MATCH(Plaza_SpawnPoint!C39,NO_참조테이블!$F:$F,0))","v":112},0]
["DEV",36,"퀸즈 팰리스 시티 빌리지",{"$f":"INDEX(NO_참조테이블!$E:$E,MATCH(Plaza_SpawnPoint!C40,NO_참조테이블!$F:$F,0))","v":112},0]
{"$rows_left_out":210}
{"sheet":"Plaza_ExchangeItem","index":5,"n_rows":18,"n_cols":7,"rows_kept":18,"cut":false,"hidden":false,"merged":[]}
["ServiceType","Key","#FieldName","FieldID","SpawnPointID","#ItemName","ItemID"]
["string","int","none","int","int","none","int"]
["All","All","Client","Client","Client","Client","Client"]
["서비스 타입","키값","필드명","필드 ID","스폰 포인트 ID","아이템명","아이템 ID"]
["DEV",1,"패션 스트릿",{"$f":"INDEX(NO_참조테이블!$E:$E,MATCH(C5,NO_참조테이블!$F:$F,0))","v":108},127,{"$f":"INDEX(NO_참조테이블!$L:$L,MATCH(Plaza_ExchangeItem!G5,NO_참조테이블!$K:$K,0))","v":"의류 수거함"},100082]
["DEV",2,"그리너리 시티 빌리지",{"$f":"INDEX(NO_참조테이블!$E:$E,MATCH(C6,NO_참조테이블!$F:$F,0))","v":109},128,{"$f":"INDEX(NO_참조테이블!$L:$L,MATCH(Plaza_ExchangeItem!G6,NO_참조테이블!$K:$K,0))","v":"리사이클링 존"},100081]
["DEV",3,"어반뷰 시티 빌리지",{"$f":"INDEX(NO_참조테이블!$E:$E,MATCH(C7,NO_참조테이블!$F:$F,0))","v":110},131,{"$f":"INDEX(NO_참조테이블!$L:$L,MATCH(Plaza_ExchangeItem!G7,NO_참조테이블!$K:$K,0))","v":"리사이클링 존"},100081]
["DEV",4,"트로피칼 선 시티 빌리지",{"$f":"INDEX(NO_참조테이블!$E:$E,MATCH(C8,NO_참조테이블!$F:$F,0))","v":111},130,{"$f":"INDEX(NO_참조테이블!$L:$L,MATCH(Plaza_ExchangeItem!G8,NO_참조테이블!$K:$K,0))","v":"리사이클링 존"},100081]
["DEV",5,"퀸즈 팰리스 시티 빌리지",{"$f":"INDEX(NO_참조테이블!$E:$E,MATCH(C9,NO_참조테이블!$F:$F,0))","v":112},129,{"$f":"INDEX(NO_참조테이블!$L:$L,MATCH(Plaza_ExchangeItem!G9,NO_참조테이블!$K:$K,0))","v":"리사이클링 존"},100081]
["DEV",6,"패션 스트릿",{"$f":"INDEX(NO_참조테이블!$E:$E,MATCH(C10,NO_참조테이블!$F:$F,0))","v":108},246,{"$f":"INDEX(NO_참조테이블!$L:$L,MATCH(Plaza_ExchangeItem!G10,NO_참조테이블!$K:$K,0))","v":"비료"},295]
["DEV",7,"패션 스트릿",{"$f":"INDEX(NO_참조테이블!$E:$E,MATCH(C11,NO_참조테이블!$F:$F,0))","v":108},247,{"$f":"INDEX(NO_참조테이블!$L:$L,MATCH(Plaza_ExchangeItem!G11,NO_참조테이블!$K:$K,0))","v":"잉크"},296]
["DEV",8,"패션 스트릿",{"$f":"INDEX(NO_참조테이블!$E:$E,MATCH(C12,NO_참조테이블!$F:$F,0))","v":108},248,{"$f":"INDEX(NO_참조테이블!$L:$L,MATCH(Plaza_ExchangeItem!G12,NO_참조테이블!$K:$K,0))","v":"모래"},297]
["DEV",20011,"패션 스퀘어",2001,20011,{"$f":"INDEX(NO_참조테이블!$L:$L,MATCH(Plaza_ExchangeItem!G13,NO_참조테이블!$K:$K,0))","v":"의류 수거함"},100082]
["DEV",20012,"패션 스퀘어",2001,20012,{"$f":"INDEX(NO_참조테이블!$L:$L,MATCH(Plaza_ExchangeItem!G14,NO_참조테이블!$K:$K,0))","v":"비료"},295]
["DEV",20013,"패션 스퀘어",2001,20013,{"$f":"INDEX(NO_참조테이블!$L:$L,MATCH(Plaza_ExchangeItem!G15,NO_참조테이블!$K:$K,0))","v":"잉크"},296]
["DEV",20014,"패션 스퀘어",2001,20014,{"$f":"INDEX(NO_참조테이블!$L:$L,MATCH(Plaza_ExchangeItem!G16,NO_참조테이블!$K:$K,0))","v":"모래"},297]
["DEV",20061,"시나모롤 하우스",{"$f":"INDEX(NO_참조테이블!$E:$E,MATCH(C17,NO_참조테이블!$F:$F,0))","v":2006},20061,{"$f":"INDEX(NO_참조테이블!$L:$L,MATCH(Plaza_ExchangeItem!G17,NO_참조테이블!$K:$K,0))","v":"열린 커튼 미니 창문 (시나모롤)"},10500016]
["DEV",20015,"플레이 스퀘어",{"$f":"INDEX(NO_참조테이블!$E:$E,MATCH(C18,NO_참조테이블!$F:$F,0))","v":2005},20015,{"$f":"INDEX(NO_참조테이블!$L:$L,MATCH(Plaza_ExchangeItem!G18,NO_참조테이블!$K:$K,0))","v":"플레이스퀘어 리사이클링함"},10500043]

{"sheet":"NO_참조테이블","index":6,"n_rows":646,"n_cols":15,"rows_kept":646,"cut":false,"hidden":false,"merged":[]}
[null,null,null,null,"[PF_FieldData.xlsm]Field!Key","[PF_FieldData.xlsm]Field!#FieldName",null,"[PF_NPCData.xlsm]NPCInfo!Key","[PF_NPCData.xlsm]NPCInfo!#NPCName",null,"[PF_ItemData.xlsm]Item!Key","[PF_ItemData.xlsm]Item!ItemNameText",null,"[PF_EnumTypeData.xlsm]EPlazaType!Key","[PF_EnumTypeData.xlsm]EPlazaType!Desc"]
[null,null,null,null,"Key","#FieldName",null,"Key","#NPCName",null,"Key","ItemNameText",null,"Key","Desc"]
[null,null,null,null,"int","none",null,"int","none",null,"int","string",null,"int","none"]
[null,null,null,null,"All","Client",null,"All","Client",null,"All","All",null,"All","All"]
[null,null,null,null,"구역 ID","구역명",null,"NPCID","#NPC명",null,"아이템 ID","아이템명",null,"열거형 숫자","요약"]
[null,null,null,null,100,"트로피칼 선 스테이트 하우스",null,1,"이브",null,1,"(임시) 기본 바닥",null,1,"벌목 랜드마크"]
["※ 데이터 입력 시작하시기 전에 ",null,null,null,101,"퀸즈 팰리스 스테이트 하우스",null,2,"토리",null,2,"브라운 키친 벽 선반",null,2,"빌리지"]
["꼭 데이터 불러와주세요!",null,null,null,102,"에버그린 스테이트 하우스",null,3,"조이",null,3,"(임시) 카펫",null,3,"센트럴타운"]
[null,null,null,null,103,"어반뷰 스테이트 하우스",null,4,"덕키",null,4,"(임시) 테이블",null,4,"일반 랜드마크"]
["※ 버튼 누른 후 관련 팝업창이 뜰",null,null,null,104,"마이 가든",null,5,"피터",null,5,"(임시) 의자",null,5,"패션 스퀘어"]
["경우, 모두 [X 버튼] 눌러주세요!",null,null,null,105,"센트럴 타운",null,6,"파커",null,6,"(임시) 소품",null,6,"시나모롤 스퀘어"]
[null,null,null,null,106,"어드벤처 포레스트",null,7,"테오",null,7,"(임시) 수상 가구",null,7,"플레이 스퀘어"]
[null,null,null,null,107,"퀸즈 팰리스 랜드마크",null,8,"올리버",null,8,"(임시) 울타리",null,8,"시나모롤 하우스"]
[null,null,null,null,108,"패션 스트릿",null,9,"루비",null,9,"(임시) 공중 벽 가구"]
[null,null,null,null,109,"그리너리 시티 빌리지",null,10,"미아",null,10,"(임시) 야외 바닥재"]
[null,null,null,null,110,"어반뷰 시티 빌리지",null,11,"리아",null,11,"(임시) 벽지"]
[null,null,null,null,111,"트로피칼 선 시티 빌리지",null,12,"콜",null,12,"(임시) 바닥재"]
[null,null,null,null,112,"퀸즈 팰리스 시티 빌리지",null,13,"이안",null,13,"(임시) 시럽"]
[null,null,null,null,2001,"패션 스퀘어",null,14,"로지",null,14,"보드라운 복숭아빛 물감"]
[null,null,null,null,2002,"미용실",null,15,"버기",null,15,"시크릿북: 민트 배쓰룸 수건대"]
[null,null,null,null,2003,"시나모롤 스퀘어",null,16,"올리버의 직원",null,16,"(임시) 스티커1"]
[null,null,null,null,2004,"타운맵",null,17,"이벤트 NPC",null,17,"옐로우 팝핑 스티커"]
[null,null,null,null,2005,"플레이 스퀘어",null,1001,"헬로키티",null,18,"(임시) 스티커3"]
[null,null,null,null,2006,"시나모롤 하우스",null,1002,"시나모롤",null,19,"(임시) 음식"]
[null,null,null,null,null,null,null,1003,"폼폼푸린",null,20,"아이템 상자 (확률형)"]
[null,null,null,null,null,null,null,2001,"쿠로미",null,23,"밭"]
[null,null,null,null,null,null,null,2002,"마이 멜로디",null,24,"밀"]
[null,null,null,null,null,null,null,3001,"포차코",null,25,"편백나무"]
[null,null,null,null,null,null,null,1004,"키키",null,26,"편백나무 자재"]
[null,null,null,null,null,null,null,1005,"라라",null,27,"감자"]
[null,null,null,null,null,null,null,3002,"한교동",null,28,"젖소"]
[null,null,null,null,null,null,null,3003,"케로케로케로피",null,29,"우유"]
[null,null,null,null,null,null,null,3004,"배드바츠마루",null,30,"고무나무"]
[null,null,null,null,null,null,null,3005,"아히루노페클",null,31,"고무 원액"]
[null,null,null,null,null,null,null,3006,"턱시도샘",null,32,"옥수수"]
[null,null,null,null,null,null,null,2003,"마이스윗피아노",null,33,"라임나무"]
[null,null,null,null,null,null,null,4001,"구데타마",null,34,"라임"]
[null,null,null,null,null,null,null,null,null,null,35,"닭"]
[null,null,null,null,null,null,null,null,null,null,36,"달걀"]
[null,null,null,null,null,null,null,null,null,null,37,"콩"]
{"$rows_left_out":606}