{"text_format":"1","workbook":"xlsx","n_sheets":6,"sheets":["NO_Table Parameter","Blueprint","Room","Yard","Field","SaveRoom"],"not_rendered":{"charts":0,"images":0,"macros":1,"external_links":3,"defined_names":1,"comments":0,"pivot_tables":0},"unopened":[],"bounds":{"document_bytes":16777216,"sheet_cells":100000,"rows_first":2000,"rows_last":500,"rows_between":2000,"halvings":0,"cell_chars":16384,"cell_head_chars":4096},"cells_cut":0,"cells_raw":0,"read":"whole","date_system":"1900"}

{"sheet":"NO_Table Parameter","index":0,"n_rows":41,"n_cols":14,"rows_kept":41,"cut":false,"hidden":false,"merged":[]}
[null,null,null,null,null,null,null,null,null,null,null,null,"[PF_EnumTypeData.xlsm]EPlaceShortcutType!Key","[PF_EnumTypeData.xlsm]EPlaceShortcutType!Desc"]
["BlueprintTable",null,null,null,null,null,"ERewardType",null,null,"EIconTag",null,null,"열거형 숫자","요약"]
["칼럼 영문명","자료형","칼럼 한글명","참조 테이블","설명",null,"ID","String",null,"ID","enum",null,1,"마이 하우스"]
["Key","int","도면 ID",null,"도면의 고유 주소 기재",null,1,"골드",null,0,"없음",null,2,"마이 빌리지"]
["BlueprintName","stringkey","스트링 코드명",null,"도면명 기재",null,2,"무료 주얼",null,1,"new",null,3,"만남의 공간"]
["IconID","string","아이콘 ID",null,"아이콘 ID 기재",null,3,"유료 주얼",null,2,"evnet",null,4,"특별관"]
["SortIndex","int","순서",null,"팝업창에 보여지는 순서 기재",null,4,"주얼",null,3,"premium"]
["IsSpecial","bool","특별 도면 여부",null,"스테이트별 스페셜 도면 여부",null,5,"하트",null,4,"hot"]
["SpecialFieldType","int","전용 필드 ID",null,"스페셜 도면의 스테이트 기입",null,6,"위시"]
["BuyPriceType","ERewardType","구매재화종류",null,"구매 재화 종류 기입",null,7,"패션"]
["BuyPriceValue","int","구매 값",null,"구매 재화 값 기입",null,8,"피스"]
[null,null,null,null,null,null,9,"기빙"]
["RoomTable",null,null,null,null,null,10,"경험치"]
["칼럼 영문명","자료형","칼럼 한글명","참조 테이블","설명",null,11,"호감도"]
["Key","int","룸 ID",null,"룸의 고유 주소 기재",null,12,"드릴"]
["RoomName","stringkey","스트링 코드명",null,"룸명 기재",null,13,"의상"]
["BlueprintID","int","도면 ID","BlueprintTable","연결된 도면의 ID 기재",null,14,"스티커"]
["IconID","none","아이콘 ID",null,"아이콘 ID 기재",null,15,"부동산"]
["IsBase","bool","기본 룸 여부",null,"처음부터 기본 제공되는 룸 여부",null,16,"차량"]
["OpenSortIndex","int","오픈 순서",null,"오픈 순서 기입",null,17,"태닝크림"]
["OpenGroupID","int","오픈 ID",null,"오픈 조건이 있을 경우 ID 기입",null,18,"패브릭물감"]
[null,null,null,null,null,null,19,"명함테마"]
["YardTable",null,null,null,null,null,20,"아이템"]
["칼럼 영문명","자료형","칼럼 한글명","참조 테이블","설명",null,21,"현금"]
["Key","int","마당 ID",null,"마당 고유 주소 기재",null,22,"마일리지"]
["FieldID","int","구역 ID","FieldTable","해당 마당의 필드 ID 기입",null,23,"프리미엄 마일리지"]
["YardName","stringkey","스트링 코드명",null,"마당명 기재"]
["IconID","none","아이콘 ID",null,"아이콘 ID 기재"]
["OpenSortIndex","int","오픈 순서",null,"오픈 순서 기입"]
["OpenGroupID","int","오픈 ID",null,"오픈 ID 기입"]
[]
["FieldTable"]
["칼럼 영문명","자료형","칼럼 한글명","참조 테이블","설명"]
["Key","int","구역 ID",null,"필드 고유 주소 기재"]
["FieldName","stringkey","스트링 코드명",null,"필드명 기재"]
["IconID","none","아이콘 ID",null,"아이콘 ID 기재"]
["IsSquare","bool","광장 여부",null,"광장일 경우 1 표시"]
["IsHouse","bool","하우스 여부",null,"하우스일 경우 1 표시"]
["BGMPrefabName","none","BGM 프리팹명",null,"BGM 프리팹명 기입"]
["IsShortcut","bool","지도 숏컷 표시 여부",null,"지적도에 숏컷이 있을 경우 1 기입"]
["IconTag","int","숏컷 아이콘 표시",null,"숏컷에 표시될 IconID 기입"]

{"sheet":"Blueprint","index":1,"n_rows":24,"n_cols":13,"rows_kept":24,"cut":false,"hidden":false,"merged":[]}
["ServiceType","Key","#BlueprintName","BlueprintName","IconID","SortIndex","FieldLimitType","#BuyPriceType","BuyPriceType","BuyPriceValue","OpenTime","#LiveDate","#UpdateVersion"]
["string","int","none","stringkey","string","int","int[]","none","ERewardType","int","datetime","none","Client"]
["All","All","Client","Client","Client","Client","Client","All","All","All","All","Client","none"]
["서비스 타입","도면 ID","도면명","스트링 코드명","아이콘 ID","순서","설치 제한 필드 ID","구매재화종류","구매재화종류","구매 값","오픈 시간","출시 일자","업데이트 버전"]
["DEV",1,"깔끔한 기본형 하우스","Blueprint_1","Blueprint_icon_1",1,{"$f":"IF(ISTEXT(#REF!),LEFT(#REF!,FIND(\":\",#REF!)-1),\"\")","v":""},"골드",{"$f":"INDEX('NO_Table Parameter'!$G:$G,MATCH(H5,'NO_Table Parameter'!$H:$H,0))","v":1},1000000,"2023-03-02T05:50:10 +09:00","2022-09-29",0]
["DEV",2,"기본형 필로티 하우스","Blueprint_2","Blueprint_icon_2",2,"100|101","골드",{"$f":"INDEX('NO_Table Parameter'!$G:$G,MATCH(H6,'NO_Table Parameter'!$H:$H,0))","v":1},1000000,"2023-03-02T05:50:10 +09:00","2022-09-29",0]
["DEV",3,"Q자형 필로티 하우스","Blueprint_3","Blueprint_icon_3",3,102,"골드",{"$f":"INDEX('NO_Table Parameter'!$G:$G,MATCH(H7,'NO_Table Parameter'!$H:$H,0))","v":1},1000000,"2023-03-02T05:50:10 +09:00","2022-09-29",0]
["DEV",4,"기본형 테트리스 하우스","Blueprint_4","Blueprint_icon_4",4,{"$f":"IF(ISTEXT(#REF!),LEFT(#REF!,FIND(\":\",#REF!)-1),\"\")","v":""},"골드",{"$f":"INDEX('NO_Table Parameter'!$G:$G,MATCH(H8,'NO_Table Parameter'!$H:$H,0))","v":1},1000000,"2023-03-02T05:50:10 +09:00","2022-09-29",0]
["DEV",5,"기본형 넓은 다락 하우스","Blueprint_5","Blueprint_icon_5",5,{"$f":"IF(ISTEXT(#REF!),LEFT(#REF!,FIND(\":\",#REF!)-1),\"\")","v":""},"골드",{"$f":"INDEX('NO_Table Parameter'!$G:$G,MATCH(H9,'NO_Table Parameter'!$H:$H,0))","v":1},1000000,"2023-03-02T05:50:10 +09:00","2022-09-29",0]
["DEV",6,"기본형 방갈로 하우스","Blueprint_6","Blueprint_icon_6",6,{"$f":"IF(ISTEXT(#REF!),LEFT(#REF!,FIND(\":\",#REF!)-1),\"\")","v":""},"골드",{"$f":"INDEX('NO_Table Parameter'!$G:$G,MATCH(H10,'NO_Table Parameter'!$H:$H,0))","v":1},1000000,"2023-03-02T05:50:10 +09:00","2022-09-29",0]
["DEV",7,"2단 필로티 하우스","Blueprint_7","Blueprint_icon_7",7,{"$f":"IF(ISTEXT(#REF!),LEFT(#REF!,FIND(\":\",#REF!)-1),\"\")","v":""},"골드",{"$f":"INDEX('NO_Table Parameter'!$G:$G,MATCH(H11,'NO_Table Parameter'!$H:$H,0))","v":1},1000000,"2023-03-02T05:50:10 +09:00","2022-09-29",0]
["DEV",8,"길다란 베이빌라 하우스","Blueprint_8","Blueprint_icon_8",8,{"$f":"IF(ISTEXT(#REF!),LEFT(#REF!,FIND(\":\",#REF!)-1),\"\")","v":""},"골드",{"$f":"INDEX('NO_Table Parameter'!$G:$G,MATCH(H12,'NO_Table Parameter'!$H:$H,0))","v":1},1000000,"2023-03-02T05:50:10 +09:00","2022-09-29",0]
["DEV",9,"다락이 있는 기본형 하우스","Blueprint_9","Blueprint_icon_9",9,{"$f":"IF(ISTEXT(#REF!),LEFT(#REF!,FIND(\":\",#REF!)-1),\"\")","v":""},"골드",{"$f":"INDEX('NO_Table Parameter'!$G:$G,MATCH(H13,'NO_Table Parameter'!$H:$H,0))","v":1},1000000,"2023-03-02T05:50:10 +09:00","2022-09-29",0]
["DEV",10,"나락한 2단 하우스","Blueprint_10","Blueprint_icon_10",10,{"$f":"IF(ISTEXT(#REF!),LEFT(#REF!,FIND(\":\",#REF!)-1),\"\")","v":""},"골드",{"$f":"INDEX('NO_Table Parameter'!$G:$G,MATCH(H14,'NO_Table Parameter'!$H:$H,0))","v":1},1000000,"2023-03-02T05:50:10 +09:00","2022-09-29",0]
["DEV",11,"L자형 프렌치 하우스","Blueprint_11","Blueprint_icon_11",11,{"$f":"IF(ISTEXT(#REF!),LEFT(#REF!,FIND(\":\",#REF!)-1),\"\")","v":""},"골드",{"$f":"INDEX('NO_Table Parameter'!$G:$G,MATCH(H15,'NO_Table Parameter'!$H:$H,0))","v":1},1000000,"2023-03-02T05:50:10 +09:00","2022-09-29",0]
["DEV",12,"N자형 프렌치 하우스","Blueprint_12","Blueprint_icon_12",12,{"$f":"IF(ISTEXT(#REF!),LEFT(#REF!,FIND(\":\",#REF!)-1),\"\")","v":""},"골드",{"$f":"INDEX('NO_Table Parameter'!$G:$G,MATCH(H16,'NO_Table Parameter'!$H:$H,0))","v":1},1000000,"2023-03-02T05:50:10 +09:00","2022-09-29",0]
["DEV",13,"세련된 오피스텔 하우스","Blueprint_13","Blueprint_icon_13",13,{"$f":"IF(ISTEXT(#REF!),LEFT(#REF!,FIND(\":\",#REF!)-1),\"\")","v":""},"골드",{"$f":"INDEX('NO_Table Parameter'!$G:$G,MATCH(H17,'NO_Table Parameter'!$H:$H,0))","v":1},1000000,"2023-03-02T05:50:10 +09:00","2022-09-29",0]
["DEV",14,"넓은 컨템포러리 하우스","Blueprint_14","Blueprint_icon_14",14,{"$f":"IF(ISTEXT(#REF!),LEFT(#REF!,FIND(\":\",#REF!)-1),\"\")","v":""},"골드",{"$f":"INDEX('NO_Table Parameter'!$G:$G,MATCH(H18,'NO_Table Parameter'!$H:$H,0))","v":1},1000000,"2023-03-02T05:50:10 +09:00","2022-09-29",0]
["DEV",15,"숲 속 트리 하우스","Blueprint_17","Blueprint_icon_15",15,{"$f":"IF(ISTEXT(#REF!),LEFT(#REF!,FIND(\":\",#REF!)-1),\"\")","v":""},"골드",{"$f":"INDEX('NO_Table Parameter'!$G:$G,MATCH(H19,'NO_Table Parameter'!$H:$H,0))","v":1},1000000,"2023-03-02T05:50:10 +09:00","2022-09-29",0]
["DEV",16,"전망 좋은 펜션 하우스","Blueprint_18","Blueprint_icon_16",16,{"$f":"IF(ISTEXT(#REF!),LEFT(#REF!,FIND(\":\",#REF!)-1),\"\")","v":""},"골드",{"$f":"INDEX('NO_Table Parameter'!$G:$G,MATCH(H20,'NO_Table Parameter'!$H:$H,0))","v":1},1000000,"2023-03-02T05:50:10 +09:00","2022-09-29",0]
["DEV",17,"쾌적한 방갈로 하우스","Blueprint_15","Blueprint_icon_17",17,{"$f":"IF(ISTEXT(#REF!),LEFT(#REF!,FIND(\":\",#REF!)-1),\"\")","v":""},"골드",{"$f":"INDEX('NO_Table Parameter'!$G:$G,MATCH(H21,'NO_Table Parameter'!$H:$H,0))","v":1},1000000,"2023-03-02T05:50:10 +09:00","2022-09-29",0]
["DEV",18,"전망 좋은 펜션 하우스","Blueprint_16","Blueprint_icon_18",18,{"$f":"IF(ISTEXT(#REF!),LEFT(#REF!,FIND(\":\",#REF!)-1),\"\")","v":""},"골드",{"$f":"INDEX('NO_Table Parameter'!$G:$G,MATCH(H22,'NO_Table Parameter'!$H:$H,0))","v":1},1000000,"2023-03-02T05:50:10 +09:00","2022-09-29",0]
["DEV",19,"커다란 3층 저택 하우스","Blueprint_19","Blueprint_icon_19",19,{"$f":"IF(ISTEXT(#REF!),LEFT(#REF!,FIND(\":\",#REF!)-1),\"\")","v":""},"골드",{"$f":"INDEX('NO_Table Parameter'!$G:$G,MATCH(H23,'NO_Table Parameter'!$H:$H,0))","v":1},1000000,"2023-03-02T05:50:10 +09:00","2022-09-29",0]
["DEV",20,"길다란 3층 저택 하우스","Blueprint_20","Blueprint_icon_20",20,{"$f":"IF(ISTEXT(#REF!),LEFT(#REF!,FIND(\":\",#REF!)-1),\"\")","v":""},"골드",{"$f":"INDEX('NO_Table Parameter'!$G:$G,MATCH(H24,'NO_Table Parameter'!$H:$H,0))","v":1},1000000,"2023-03-02T05:50:10 +09:00","2022-09-29",0]

{"sheet":"Room","index":2,"n_rows":124,"n_cols":16,"rows_kept":124,"cut":false,"hidden":false,"merged":[]}
["ServiceType","Key","#RoomName","RoomName","BlueprintID","IconID","IsBase","OpenSortIndex","#BuyPriceType","BuyPriceType","BuyPriceValue","FieldPrefabName","HouseSkinIconName","OpenTime","#LiveDate","#UpdateVersion"]
["string","int","none","stringkey","int","string","bool","int","none","ERewardType","int","string","string","datetime","none","Client"]
["All","All","Client","Client","All","Client","Client","Client","All","All","All","Client","Client","All","Client","none"]
["서비스 타입","룸 ID","룸명","스트링 코드명","도면 ID","룸 아이콘 ID","기본 룸 여부","오픈 순서","구매재화종류","구매재화종류","구매 값","프리팹명","하우스 외형 아이콘명","오픈 시간","출시 일자","업데이트 버전"]
["DEV",1000,"소중한 첫번째 방","Room_1000",1,"Room_icon_1",1,1,"주얼",{"$f":"INDEX('NO_Table Parameter'!$G:$G,MATCH(I5,'NO_Table Parameter'!$H:$H,0))","v":4},1000,"Blueprint1_Room1","Blueprint1_Room1_icon","2023-03-02T05:50:10 +09:00","2022-09-29",0]
["DEV",1001,"첫번째 옆방","Room_1001",1,"Room_icon_2",0,2,"주얼",{"$f":"INDEX('NO_Table Parameter'!$G:$G,MATCH(I6,'NO_Table Parameter'!$H:$H,0))","v":4},1000,"Blueprint1_Room2","Blueprint1_Room2_icon","2023-03-02T05:50:10 +09:00","2022-09-29",0]
["DEV",1002,"새로운 옆방","Room_1002",1,"Room_icon_3",0,3,"주얼",{"$f":"INDEX('NO_Table Parameter'!$G:$G,MATCH(I7,'NO_Table Parameter'!$H:$H,0))","v":4},1000,"Blueprint1_Room3","Blueprint1_Room3_icon","2023-03-02T05:50:10 +09:00","2022-09-29",0]
["DEV",1003,"힐링 공간","Room_1003",1,"Room_icon_4",0,4,"주얼",{"$f":"INDEX('NO_Table Parameter'!$G:$G,MATCH(I8,'NO_Table Parameter'!$H:$H,0))","v":4},1000,"Blueprint1_Room4","Blueprint1_Room4_icon","2023-03-02T05:50:10 +09:00","2022-09-29",0]
["DEV",1004,"설렘 공간","Room_1004",1,"Room_icon_5",0,5,"주얼",{"$f":"INDEX('NO_Table Parameter'!$G:$G,MATCH(I9,'NO_Table Parameter'!$H:$H,0))","v":4},1000,"Blueprint1_Room5","Blueprint1_Room5_icon","2023-03-02T05:50:10 +09:00","2022-09-29",0]
["DEV",1005,"라스트 모퉁이 방","Room_1005",1,"Room_icon_6",0,6,"주얼",{"$f":"INDEX('NO_Table Parameter'!$G:$G,MATCH(I10,'NO_Table Parameter'!$H:$H,0))","v":4},1000,"Blueprint1_Room6","Blueprint1_Room6_icon","2023-03-02T05:50:10 +09:00","2022-09-29",0]
["DEV",1006,"소중한 첫번째 방","Room_1006",2,"Room_icon_1",1,1,"주얼",{"$f":"INDEX('NO_Table Parameter'!$G:$G,MATCH(I11,'NO_Table Parameter'!$H:$H,0))","v":4},1000,"Blueprint2_Room1","Blueprint2_Room1_icon","2023-03-02T05:50:10 +09:00","2022-09-29",0]
["DEV",1007,"첫번째 옆방","Room_1007",2,"Room_icon_2",0,2,"주얼",{"$f":"INDEX('NO_Table Parameter'!$G:$G,MATCH(I12,'NO_Table Parameter'!$H:$H,0))","v":4},1000,"Blueprint2_Room2","Blueprint2_Room2_icon","2023-03-02T05:50:10 +09:00","2022-09-29",0]
["DEV",1008,"새로운 옆방","Room_1008",2,"Room_icon_3",0,3,"주얼",{"$f":"INDEX('NO_Table Parameter'!$G:$G,MATCH(I13,'NO_Table Parameter'!$H:$H,0))","v":4},1000,"Blueprint2_Room3","Blueprint2_Room3_icon","2023-03-02T05:50:10 +09:00","2022-09-29",0]
["DEV",1009,"힐링 공간","Room_1009",2,"Room_icon_4",0,4,"주얼",{"$f":"INDEX('NO_Table Parameter'!$G:$G,MATCH(I14,'NO_Table Parameter'!$H:$H,0))","v":4},1000,"Blueprint2_Room4","Blueprint2_Room4_icon","2023-03-02T05:50:10 +09:00","2022-09-29",0]
["DEV",1010,"설렘 공간","Room_1010",2,"Room_icon_5",0,5,"주얼",{"$f":"INDEX('NO_Table Parameter'!$G:$G,MATCH(I15,'NO_Table Parameter'!$H:$H,0))","v":4},1000,"Blueprint2_Room5","Blueprint2_Room5_icon","2023-03-02T05:50:10 +09:00","2022-09-29",0]
["DEV",1011,"라스트 모퉁이 방","Room_1011",2,"Room_icon_6",0,6,"주얼",{"$f":"INDEX('NO_Table Parameter'!$G:$G,MATCH(I16,'NO_Table Parameter'!$H:$H,0))","v":4},1000,"Blueprint2_Room6","Blueprint2_Room6_icon","2023-03-02T05:50:10 +09:00","2022-09-29",0]
["DEV",1012,"소중한 첫번째 방","Room_1012",3,"Room_icon_1",1,1,"주얼",{"$f":"INDEX('NO_Table Parameter'!$G:$G,MATCH(I17,'NO_Table Parameter'!$H:$H,0))","v":4},1000,"Blueprint3_Room1","Blueprint3_Room1_icon","2023-03-02T05:50:10 +09:00","2022-09-29",0]
["DEV",1013,"첫번째 2층 방","Room_1013",3,"Room_icon_2",0,2,"주얼",{"$f":"INDEX('NO_Table Parameter'!$G:$G,MATCH(I18,'NO_Table Parameter'!$H:$H,0))","v":4},1000,"Blueprint3_Room2","Blueprint3_Room2_icon","2023-03-02T05:50:10 +09:00","2022-09-29",0]
["DEV",1014,"새로운 2층 방","Room_1014",3,"Room_icon_3",0,3,"주얼",{"$f":"INDEX('NO_Table Parameter'!$G:$G,MATCH(I19,'NO_Table Parameter'!$H:$H,0))","v":4},1000,"Blueprint3_Room3","Blueprint3_Room3_icon","2023-03-02T05:50:10 +09:00","2022-09-29",0]
["DEV",1015,"힐링 공간","Room_1015",3,"Room_icon_4",0,4,"주얼",{"$f":"INDEX('NO_Table Parameter'!$G:$G,MATCH(I20,'NO_Table Parameter'!$H:$H,0))","v":4},1000,"Blueprint3_Room4","Blueprint3_Room4_icon","2023-03-02T05:50:10 +09:00","2022-09-29",0]
["DEV",1016,"설렘 공간","Room_1016",3,"Room_icon_5",0,5,"주얼",{"$f":"INDEX('NO_Table Parameter'!$G:$G,MATCH(I21,'NO_Table Parameter'!$H:$H,0))","v":4},1000,"Blueprint3_Room5","Blueprint3_Room5_icon","2023-03-02T05:50:10 +09:00","2022-09-29",0]
["DEV",1017,"라스트 모퉁이 방","Room_1017",3,"Room_icon_6",0,6,"주얼",{"$f":"INDEX('NO_Table Parameter'!$G:$G,MATCH(I22,'NO_Table Parameter'!$H:$H,0))","v":4},1000,"Blueprint3_Room6","Blueprint3_Room6_icon","2023-03-02T05:50:10 +09:00","2022-09-29",0]
["DEV",1018,"소중한 첫번째 방","Room_1018",4,"Room_icon_1",1,1,"주얼",{"$f":"INDEX('NO_Table Parameter'!$G:$G,MATCH(I23,'NO_Table Parameter'!$H:$H,0))","v":4},1000,"Blueprint4_Room1","Blueprint4_Room1_icon","2023-03-02T05:50:10 +09:00","2022-09-29",0]
["DEV",1019,"첫번째 옆방","Room_1019",4,"Room_icon_2",0,2,"주얼",{"$f":"INDEX('NO_Table Parameter'!$G:$G,MATCH(I24,'NO_Table Parameter'!$H:$H,0))","v":4},1000,"Blueprint4_Room2","Blueprint4_Room2_icon","2023-03-02T05:50:10 +09:00","2022-09-29",0]
["DEV",1020,"새로운 옆방","Room_1020",4,"Room_icon_3",0,3,"주얼",{"$f":"INDEX('NO_Table Parameter'!$G:$G,MATCH(I25,'NO_Table Parameter'!$H:$H,0))","v":4},1000,"Blueprint4_Room3","Blueprint4_Room3_icon","2023-03-02T05:50:10 +09:00","2022-09-29",0]
["DEV",1021,"첫번째 2층 방","Room_1021",4,"Room_icon_4",0,4,"주얼",{"$f":"INDEX('NO_Table Parameter'!$G:$G,MATCH(I26,'NO_Table Parameter'!$H:$H,0))","v":4},1000,"Blueprint4_Room4","Blueprint4_Room4_icon","2023-03-02T05:50:10 +09:00","2022-09-29",0]
["DEV",1022,"새로운 2층 방","Room_1022",4,"Room_icon_5",0,5,"주얼",{"$f":"INDEX('NO_Table Parameter'!$G:$G,MATCH(I27,'NO_Table Parameter'!$H:$H,0))","v":4},1000,"Blueprint4_Room5","Blueprint4_Room5_icon","2023-03-02T05:50:10 +09:00","2022-09-29",0]
["DEV",1023,"라스트 모퉁이 방","Room_1023",4,"Room_icon_6",0,6,"주얼",{"$f":"INDEX('NO_Table Parameter'!$G:$G,MATCH(I28,'NO_Table Parameter'!$H:$H,0))","v":4},1000,"Blueprint4_Room6","Blueprint4_Room6_icon","2023-03-02T05:50:10 +09:00","2022-09-29",0]
["DEV",1024,"소중한 첫번째 방","Room_1024",5,"Room_icon_1",1,1,"주얼",{"$f":"INDEX('NO_Table Parameter'!$G:$G,MATCH(I29,'NO_Table Parameter'!$H:$H,0))","v":4},1000,"Blueprint5_Room1","Blueprint5_Room1_icon","2023-03-02T05:50:10 +09:00","2022-09-29",0]
["DEV",1025,"첫번째 옆방","Room_1025",5,"Room_icon_2",0,2,"주얼",{"$f":"INDEX('NO_Table Parameter'!$G:$G,MATCH(I30,'NO_Table Parameter'!$H:$H,0))","v":4},1000,"Blueprint5_Room2","Blueprint5_Room2_icon","2023-03-02T05:50:10 +09:00","2022-09-29",0]
["DEV",1026,"새로운 옆방","Room_1026",5,"Room_icon_3",0,3,"주얼",{"$f":"INDEX('NO_Table Parameter'!$G:$G,MATCH(I31,'NO_Table Parameter'!$H:$H,0))","v":4},1000,"Blueprint5_Room3","Blueprint5_Room3_icon","2023-03-02T05:50:10 +09:00","2022-09-29",0]
["DEV",1027,"힐링 공간","Room_1027",5,"Room_icon_4",0,4,"주얼",{"$f":"INDEX('NO_Table Parameter'!$G:$G,MATCH(I32,'NO_Table Parameter'!$H:$H,0))","v":4},1000,"Blueprint5_Room4","Blueprint5_Room4_icon","2023-03-02T05:50:10 +09:00","2022-09-29",0]
["DEV",1028,"첫번째 2층 방","Room_1028",5,"Room_icon_5",0,5,"주얼",{"$f":"INDEX('NO_Table Parameter'!$G:$G,MATCH(I33,'NO_Table Parameter'!$H:$H,0))","v":4},1000,"Blueprint5_Room5","Blueprint5_Room5_icon","2023-03-02T05:50:10 +09:00","2022-09-29",0]
["DEV",1029,"라스트 모퉁이 방","Room_1029",5,"Room_icon_6",0,6,"주얼",{"$f":"INDEX('NO_Table Parameter'!$G:$G,MATCH(I34,'NO_Table Parameter'!$H:$H,0))","v":4},1000,"Blueprint5_Room6","Blueprint5_Room6_icon","2023-03-02T05:50:10 +09:00","2022-09-29",0]
["DEV",1030,"소중한 첫번째 방","Room_1030",6,"Room_icon_1",1,1,"주얼",{"$f":"INDEX('NO_Table Parameter'!$G:$G,MATCH(I35,'NO_Table Parameter'!$H:$H,0))","v":4},1000,"Blueprint6_Room1","Blueprint6_Room1_icon","2023-03-02T05:50:10 +09:00","2022-09-29",0]
["DEV",1031,"첫번째 옆방","Room_1031",6,"Room_icon_2",0,2,"주얼",{"$f":"INDEX('NO_Table Parameter'!$G:$G,MATCH(I36,'NO_Table Parameter'!$H:$H,0))","v":4},1000,"Blueprint6_Room2","Blueprint6_Room2_icon","2023-03-02T05:50:10 +09:00","2022-09-29",0]
["DEV",1032,"첫번째 2층 방","Room_1032",6,"Room_icon_3",0,3,"주얼",{"$f":"INDEX('NO_Table Parameter'!$G:$G,MATCH(I37,'NO_Table Parameter'!$H:$H,0))","v":4},1000,"Blueprint6_Room3","Blueprint6_Room3_icon","2023-03-02T05:50:10 +09:00","2022-09-29",0]
["DEV",1033,"새로운 2층 방","Room_1033",6,"Room_icon_4",0,4,"주얼",{"$f":"INDEX('NO_Table Parameter'!$G:$G,MATCH(I38,'NO_Table Parameter'!$H:$H,0))","v":4},1000,"Blueprint6_Room4","Blueprint6_Room4_icon","2023-03-02T05:50:10 +09:00","2022-09-29",0]
["DEV",1034,"힐링 공간","Room_1034",6,"Room_icon_5",0,5,"주얼",{"$f":"INDEX('NO_Table Parameter'!$G:$G,MATCH(I39,'NO_Table Parameter'!$H:$H,0))","v":4},1000,"Blueprint6_Room5","Blueprint6_Room5_icon","2023-03-02T05:50:10 +09:00","2022-09-29",0]
["DEV",1035,"라스트 모퉁이 방","Room_1035",6,"Room_icon_6",0,6,"주얼",{"$f":"INDEX('NO_Table Parameter'!$G:$G,MATCH(I40,'NO_Table Parameter'!$H:$H,0))","v":4},1000,"Blueprint6_Room6","Blueprint6_Room6_icon","2023-03-02T05:50:10 +09:00","2022-09-29",0]
["DEV",1036,"소중한 첫번째 방","Room_1036",7,"Room_icon_1",1,1,"주얼",{"$f":"INDEX('NO_Table Parameter'!$G:$G,MATCH(I41,'NO_Table Parameter'!$H:$H,0))","v":4},1000,"Blueprint7_Room1","Blueprint7_Room1_icon","2023-03-02T05:50:10 +09:00","2022-09-29",0]
["DEV",1037,"첫번째 옆방","Room_1037",7,"Room_icon_2",0,2,"주얼",{"$f":"INDEX('NO_Table Parameter'!$G:$G,MATCH(I42,'NO_Table Parameter'!$H:$H,0))","v":4},1000,"Blueprint7_Room2","Blueprint7_Room2_icon","2023-03-02T05:50:10 +09:00","2022-09-29",0]
["DEV",1038,"새로운 옆방","Room_1038",7,"Room_icon_3",0,3,"주얼",{"$f":"INDEX('NO_Table Parameter'!$G:$G,MATCH(I43,'NO_Table Parameter'!$H:$H,0))","v":4},1000,"Blueprint7_Room3","Blueprint7_Room3_icon","2023-03-02T05:50:10 +09:00","2022-09-29",0]
["DEV",1039,"힐링 공간","Room_1039",7,"Room_icon_4",0,4,"주얼",{"$f":"INDEX('NO_Table Parameter'!$G:$G,MATCH(I44,'NO_Table Parameter'!$H:$H,0))","v":4},1000,"Blueprint7_Room4","Blueprint7_Room4_icon","2023-03-02T05:50:10 +09:00","2022-09-29",0]
["DEV",1040,"첫번째 2층 방","Room_1040",7,"Room_icon_5",0,5,"주얼",{"$f":"INDEX('NO_Table Parameter'!$G:$G,MATCH(I45,'NO_Table Parameter'!$H:$H,0))","v":4},1000,"Blueprint7_Room5","Blueprint7_Room5_icon","2023-03-02T05:50:10 +09:00","2022-09-29",0]
["DEV",1041,"라스트 모퉁이 방","Room_1041",7,"Room_icon_6",0,6,"주얼",{"$f":"INDEX('NO_Table Parameter'!$G:$G,MATCH(I46,'NO_Table Parameter'!$H:$H,0))","v":4},1000,"Blueprint7_Room6","Blueprint7_Room6_icon","2023-03-02T05:50:10 +09:00","2022-09-29",0]
["DEV",1042,"소중한 첫번째 방","Room_1042",8,"Room_icon_1",1,1,"주얼",{"$f":"INDEX('NO_Table Parameter'!$G:$G,MATCH(I47,'NO_Table Parameter'!$H:$H,0))","v":4},1000,"Blueprint8_Room1","Blueprint8_Room1_icon","2023-03-02T05:50:10 +09:00","2022-09-29",0]
["DEV",1043,"숨겨진 아지트 방","Room_1043",8,"Room_icon_2",0,2,"주얼",{"$f":"INDEX('NO_Table Parameter'!$G:$G,MATCH(I48,'NO_Table Parameter'!$H:$H,0))","v":4},1000,"Blueprint8_Room2","Blueprint8_Room2_icon","2023-03-02T05:50:10 +09:00","2022-09-29",0]
["DEV",1044,"첫번째 2층 방","Room_1044",8,"Room_icon_3",0,3,"주얼",{"$f":"INDEX('NO_Table Parameter'!$G:$G,MATCH(I49,'NO_Table Parameter'!$H:$H,0))","v":4},1000,"Blueprint8_Room3","Blueprint8_Room3_icon","2023-03-02T05:50:10 +09:00","2022-09-29",0]
["DEV",1045,"새로운 2층 방","Room_1045",8,"Room_icon_4",0,4,"주얼",{"$f":"INDEX('NO_Table Parameter'!$G:$G,MATCH(I50,'NO_Table Parameter'!$H:$H,0))","v":4},1000,"Blueprint8_Room4","Blueprint8_Room4_icon","2023-03-02T05:50:10 +09:00","2022-09-29",0]
["DEV",1046,"힐링 공간","Room_1046",8,"Room_icon_5",0,5,"주얼",{"$f":"INDEX('NO_Table Parameter'!$G:$G,MATCH(I51,'NO_Table Parameter'!$H:$H,0))","v":4},1000,"Blueprint8_Room5","Blueprint8_Room5_icon","2023-03-02T05:50:10 +09:00","2022-09-29",0]
["DEV",1047,"라스트 모퉁이 방","Room_1047",8,"Room_icon_6",0,6,"주얼",{"$f":"INDEX('NO_Table Parameter'!$G:$G,MATCH(I52,'NO_Table Parameter'!$H:$H,0))","v":4},1000,"Blueprint8_Room6","Blueprint8_Room6_icon","2023-03-02T05:50:10 +09:00","2022-09-29",0]
["DEV",1048,"소중한 첫번째 방","Room_1048",9,"Room_icon_1",1,1,"주얼",{"$f":"INDEX('NO_Table Parameter'!$G:$G,MATCH(I53,'NO_Table Parameter'!$H:$H,0))","v":4},1000,"Blueprint9_Room1","Blueprint9_Room1_icon","2023-03-02T05:50:10 +09:00","2022-09-29",0]
["DEV",1049,"첫번째 옆방","Room_1049",9,"Room_icon_2",0,2,"주얼",{"$f":"INDEX('NO_Table Parameter'!$G:$G,MATCH(I54,'NO_Table Parameter'!$H:$H,0))","v":4},1000,"Blueprint9_Room2","Blueprint9_Room2_icon","2023-03-02T05:50:10 +09:00","2022-09-29",0]
["DEV",1050,"새로운 옆방","Room_1050",9,"Room_icon_3",0,3,"주얼",{"$f":"INDEX('NO_Table Parameter'!$G:$G,MATCH(I55,'NO_Table Parameter'!$H:$H,0))","v":4},1000,"Blueprint9_Room3","Blueprint9_Room3_icon","2023-03-02T05:50:10 +09:00","2022-09-29",0]
["DEV",1051,"힐링 공간","Room_1051",9,"Room_icon_4",0,4,"주얼",{"$f":"INDEX('NO_Table Parameter'!$G:$G,MATCH(I56,'NO_Table Parameter'!$H:$H,0))","v":4},1000,"Blueprint9_Room4","Blueprint9_Room4_icon","2023-03-02T05:50:10 +09:00","2022-09-29",0]
["DEV",1052,"설렘 공간","Room_1052",9,"Room_icon_5",0,5,"주얼",{"$f":"INDEX('NO_Table Parameter'!$G:$G,MATCH(I57,'NO_Table Parameter'!$H:$H,0))","v":4},1000,"Blueprint9_Room5","Blueprint9_Room5_icon","2023-03-02T05:50:10 +09:00","2022-09-29",0]
["DEV",1053,"라스트 모퉁이 방","Room_1053",9,"Room_icon_6",0,6,"주얼",{"$f":"INDEX('NO_Table Parameter'!$G:$G,MATCH(I58,'NO_Table Parameter'!$H:$H,0))","v":4},1000,"Blueprint9_Room6","Blueprint9_Room6_icon","2023-03-02T05:50:10 +09:00","2022-09-29",0]
["DEV",1054,"소중한 첫번째 방","Room_1054",10,"Room_icon_1",1,1,"주얼",{"$f":"INDEX('NO_Table Parameter'!$G:$G,MATCH(I59,'NO_Table Parameter'!$H:$H,0))","v":4},1000,"Blueprint10_Room1","Blueprint10_Room1_icon","2023-03-02T05:50:10 +09:00","2022-09-29",0]
["DEV",1055,"첫번째 옆방","Room_1055",10,"Room_icon_2",0,2,"주얼",{"$f":"INDEX('NO_Table Parameter'!$G:$G,MATCH(I60,'NO_Table Parameter'!$H:$H,0))","v":4},1000,"Blueprint10_Room2","Blueprint10_Room2_icon","2023-03-02T05:50:10 +09:00","2022-09-29",0]
["DEV",1056,"새로운 옆방","Room_1056",10,"Room_icon_3",0,3,"주얼",{"$f":"INDEX('NO_Table Parameter'!$G:$G,MATCH(I61,'NO_Table Parameter'!$H:$H,0))","v":4},1000,"Blueprint10_Room3","Blueprint10_Room3_icon","2023-03-02T05:50:10 +09:00","2022-09-29",0]
["DEV",1057,"첫번째 2층 방","Room_1057",10,"Room_icon_4",0,4,"주얼",{"$f":"INDEX('NO_Table Parameter'!$G:$G,MATCH(I62,'NO_Table Parameter'!$H:$H,0))","v":4},1000,"Blueprint10_Room4","Blueprint10_Room4_icon","2023-03-02T05:50:10 +09:00","2022-09-29",0]
["DEV",1058,"새로운 2층 방","Room_1058",10,"Room_icon_5",0,5,"주얼",{"$f":"INDEX('NO_Table Parameter'!$G:$G,MATCH(I63,'NO_Table Parameter'!$H:$H,0))","v":4},1000,"Blueprint10_Room5","Blueprint10_Room5_icon","2023-03-02T05:50:10 +09:00","2022-09-29",0]
["DEV",1059,"라스트 모퉁이 방","Room_1059",10,"Room_icon_6",0,6,"주얼",{"$f":"INDEX('NO_Table Parameter'!$G:$G,MATCH(I64,'NO_Table Parameter'!$H:$H,0))","v":4},1000,"Blueprint10_Room6","Blueprint10_Room6_icon","2023-03-02T05:50:10 +09:00","2022-09-29",0]
["DEV",1060,"소중한 첫번째 방","Room_1060",11,"Room_icon_1",1,1,"주얼",{"$f":"INDEX('NO_Table Parameter'!$G:$G,MATCH(I65,'NO_Table Parameter'!$H:$H,0))","v":4},1000,"Blueprint11_Room1","Blueprint11_Room1_icon","2023-03-02T05:50:10 +09:00","2022-09-29",0]
["DEV",1061,"첫번째 옆방","Room_1061",11,"Room_icon_2",0,2,"주얼",{"$f":"INDEX('NO_Table Parameter'!$G:$G,MATCH(I66,'NO_Table Parameter'!$H:$H,0))","v":4},1000,"Blueprint11_Room2","Blueprint11_Room2_icon","2023-03-02T05:50:10 +09:00","2022-09-29",0]
["DEV",1062,"첫번째 2층 방","Room_1062",11,"Room_icon_3",0,3,"주얼",{"$f":"INDEX('NO_Table Parameter'!$G:$G,MATCH(I67,'NO_Table Parameter'!$H:$H,0))","v":4},1000,"Blueprint11_Room3","Blueprint11_Room3_icon","2023-03-02T05:50:10 +09:00","2022-09-29",0]
["DEV",1063,"새로운 2층 방","Room_1063",11,"Room_icon_4",0,4,"주얼",{"$f":"INDEX('NO_Table Parameter'!$G:$G,MATCH(I68,'NO_Table Parameter'!$H:$H,0))","v":4},1000,"Blueprint11_Room4","Blueprint11_Room4_icon","2023-03-02T05:50:10 +09:00","2022-09-29",0]
["DEV",1064,"힐링 공간","Room_1064",11,"Room_icon_5",0,5,"주얼",{"$f":"INDEX('NO_Table Parameter'!$G:$G,MATCH(I69,'NO_Table Parameter'!$H:$H,0))","v":4},1000,"Blueprint11_Room5","Blueprint11_Room5_icon","2023-03-02T05:50:10 +09:00","2022-09-29",0]
["DEV",1065,"라스트 모퉁이 방","Room_1065",11,"Room_icon_6",0,6,"주얼",{"$f":"INDEX('NO_Table Parameter'!$G:$G,MATCH(I70,'NO_Table Parameter'!$H:$H,0))","v":4},1000,"Blueprint11_Room6","Blueprint11_Room6_icon","2023-03-02T05:50:10 +09:00","2022-09-29",0]
["DEV",1066,"소중한 첫번째 방","Room_1066",12,"Room_icon_1",1,1,"주얼",{"$f":"INDEX('NO_Table Parameter'!$G:$G,MATCH(I71,'NO_Table Parameter'!$H:$H,0))","v":4},1000,"Blueprint12_Room1","Blueprint12_Room1_icon","2023-03-02T05:50:10 +09:00","2022-09-29",0]
["DEV",1067,"첫번째 2층 방","Room_1067",12,"Room_icon_2",0,2,"주얼",{"$f":"INDEX('NO_Table Parameter'!$G:$G,MATCH(I72,'NO_Table Parameter'!$H:$H,0))","v":4},1000,"Blueprint12_Room2","Blueprint12_Room2_icon","2023-03-02T05:50:10 +09:00","2022-09-29",0]
["DEV",1068,"새로운 2층 방","Room_1068",12,"Room_icon_3",0,3,"주얼",{"$f":"INDEX('NO_Table Parameter'!$G:$G,MATCH(I73,'NO_Table Parameter'!$H:$H,0))","v":4},1000,"Blueprint12_Room3","Blueprint12_Room3_icon","2023-03-02T05:50:10 +09:00","2022-09-29",0]
["DEV",1069,"힐링 공간","Room_1069",12,"Room_icon_4",0,4,"주얼",{"$f":"INDEX('NO_Table Parameter'!$G:$G,MATCH(I74,'NO_Table Parameter'!$H:$H,0))","v":4},1000,"Blueprint12_Room4","Blueprint12_Room4_icon","2023-03-02T05:50:10 +09:00","2022-09-29",0]
["DEV",1070,"설렘 공간","Room_1070",12,"Room_icon_5",0,5,"주얼",{"$f":"INDEX('NO_Table Parameter'!$G:$G,MATCH(I75,'NO_Table Parameter'!$H:$H,0))","v":4},1000,"Blueprint12_Room5","Blueprint12_Room5_icon","2023-03-02T05:50:10 +09:00","2022-09-29",0]
["DEV",1071,"라스트 모퉁이 방","Room_1071",12,"Room_icon_6",0,6,"주얼",{"$f":"INDEX('NO_Table Parameter'!$G:$G,MATCH(I76,'NO_Table Parameter'!$H:$H,0))","v":4},1000,"Blueprint12_Room6","Blueprint12_Room6_icon","2023-03-02T05:50:10 +09:00","2022-09-29",0]
["DEV",1072,"메인 룸","Room_1072",13,"Room_icon_1",1,1,"주얼",{"$f":"INDEX('NO_Table Parameter'!$G:$G,MATCH(I77,'NO_Table Parameter'!$H:$H,0))","v":4},1000,"Blueprint13_Room1","Blueprint13_Room1_icon","2023-03-02T05:50:10 +09:00","2022-09-29",0]
["DEV",1073,"메인룸의 확장공간","Room_1073",13,"Room_icon_2",0,2,"주얼",{"$f":"INDEX('NO_Table Parameter'!$G:$G,MATCH(I78,'NO_Table Parameter'!$H:$H,0))","v":4},1000,"Blueprint13_Room2","Blueprint13_Room2_icon","2023-03-02T05:50:10 +09:00","2022-09-29",0]
["DEV",1074,"맞은편 옵션 방","Room_1074",13,"Room_icon_3",0,3,"주얼",{"$f":"INDEX('NO_Table Parameter'!$G:$G,MATCH(I79,'NO_Table Parameter'!$H:$H,0))","v":4},1000,"Blueprint13_Room3","Blueprint13_Room3_icon","2023-03-02T05:50:10 +09:00","2022-09-29",0]
["DEV",1075,"옵션 방의 확장공간","Room_1075",13,"Room_icon_4",0,4,"주얼",{"$f":"INDEX('NO_Table Parameter'!$G:$G,MATCH(I80,'NO_Table Parameter'!$H:$H,0))","v":4},1000,"Blueprint13_Room4","Blueprint13_Room4_icon","2023-03-02T05:50:10 +09:00","2022-09-29",0]
["DEV",1076,"복층 오피스 공간","Room_1076",13,"Room_icon_5",0,5,"주얼",{"$f":"INDEX('NO_Table Parameter'!$G:$G,MATCH(I81,'NO_Table Parameter'!$H:$H,0))","v":4},1000,"Blueprint13_Room5","Blueprint13_Room5_icon","2023-03-02T05:50:10 +09:00","2022-09-29",0]
["DEV",1077,"라스트 모퉁이 방","Room_1077",13,"Room_icon_6",0,6,"주얼",{"$f":"INDEX('NO_Table Parameter'!$G:$G,MATCH(I82,'NO_Table Parameter'!$H:$H,0))","v":4},1000,"Blueprint13_Room6","Blueprint13_Room6_icon","2023-03-02T05:50:10 +09:00","2022-09-29",0]
["DEV",1078,"메인 룸","Room_1078",14,"Room_icon_1",1,1,"주얼",{"$f":"INDEX('NO_Table Parameter'!$G:$G,MATCH(I83,'NO_Table Parameter'!$H:$H,0))","v":4},1000,"Blueprint14_Room1","Blueprint14_Room1_icon","2023-03-02T05:50:10 +09:00","2022-09-29",0]
["DEV",1079,"메인룸의 확장공간","Room_1079",14,"Room_icon_2",0,2,"주얼",{"$f":"INDEX('NO_Table Parameter'!$G:$G,MATCH(I84,'NO_Table Parameter'!$H:$H,0))","v":4},1000,"Blueprint14_Room2","Blueprint14_Room2_icon","2023-03-02T05:50:10 +09:00","2022-09-29",0]
["DEV",1080,"복층 발코니","Room_1080",14,"Room_icon_3",0,3,"주얼",{"$f":"INDEX('NO_Table Parameter'!$G:$G,MATCH(I85,'NO_Table Parameter'!$H:$H,0))","v":4},1000,"Blueprint14_Room3","Blueprint14_Room3_icon","2023-03-02T05:50:10 +09:00","2022-09-29",0]
["DEV",1081,"2층 메인공간","Room_1081",14,"Room_icon_4",0,4,"주얼",{"$f":"INDEX('NO_Table Parameter'!$G:$G,MATCH(I86,'NO_Table Parameter'!$H:$H,0))","v":4},1000,"Blueprint14_Room4","Blueprint14_Room4_icon","2023-03-02T05:50:10 +09:00","2022-09-29",0]
["DEV",1082,"쾌적한 연결공간","Room_1082",14,"Room_icon_5",0,5,"주얼",{"$f":"INDEX('NO_Table Parameter'!$G:$G,MATCH(I87,'NO_Table Parameter'!$H:$H,0))","v":4},1000,"Blueprint14_Room5","Blueprint14_Room5_icon","2023-03-02T05:50:10 +09:00","2022-09-29",0]
["DEV",1083,"라스트 모퉁이 방","Room_1083",14,"Room_icon_6",0,6,"주얼",{"$f":"INDEX('NO_Table Parameter'!$G:$G,MATCH(I88,'NO_Table Parameter'!$H:$H,0))","v":4},1000,"Blueprint14_Room6","Blueprint14_Room6_icon","2023-03-02T05:50:10 +09:00","2022-09-29",0]
["DEV",1084,"소중한 첫번째 방","Room_1084",15,"Room_icon_1",1,1,"주얼",{"$f":"INDEX('NO_Table Parameter'!$G:$G,MATCH(I89,'NO_Table Parameter'!$H:$H,0))","v":4},1000,"Blueprint15_Room1","Blueprint15_Room1_icon","2023-03-02T05:50:10 +09:00","2022-09-29",0]
["DEV",1085,"상쾌한 편백나무 방","Room_1085",15,"Room_icon_2",0,2,"주얼",{"$f":"INDEX('NO_Table Parameter'!$G:$G,MATCH(I90,'NO_Table Parameter'!$H:$H,0))","v":4},1000,"Blueprint15_Room2","Blueprint15_Room2_icon","2023-03-02T05:50:10 +09:00","2022-09-29",0]
["DEV",1086,"따스한 남향 방","Room_1086",15,"Room_icon_3",0,3,"주얼",{"$f":"INDEX('NO_Table Parameter'!$G:$G,MATCH(I91,'NO_Table Parameter'!$H:$H,0))","v":4},1000,"Blueprint15_Room3","Blueprint15_Room3_icon","2023-03-02T05:50:10 +09:00","2022-09-29",0]
["DEV",1087,"구석자리 휴식 방","Room_1087",15,"Room_icon_4",0,4,"주얼",{"$f":"INDEX('NO_Table Parameter'!$G:$G,MATCH(I92,'NO_Table Parameter'!$H:$H,0))","v":4},1000,"Blueprint15_Room4","Blueprint15_Room4_icon","2023-03-02T05:50:10 +09:00","2022-09-29",0]
["DEV",1088,"햇살이 드는 2층 방","Room_1088",15,"Room_icon_5",0,5,"주얼",{"$f":"INDEX('NO_Table Parameter'!$G:$G,MATCH(I93,'NO_Table Parameter'!$H:$H,0))","v":4},1000,"Blueprint15_Room5","Blueprint15_Room5_icon","2023-03-02T05:50:10 +09:00","2022-09-29",0]
["DEV",1089,"나만 아는 비밀 다락","Room_1089",15,"Room_icon_6",0,6,"주얼",{"$f":"INDEX('NO_Table Parameter'!$G:$G,MATCH(I94,'NO_Table Parameter'!$H:$H,0))","v":4},1000,"Blueprint15_Room6","Blueprint15_Room6_icon","2023-03-02T05:50:10 +09:00","2022-09-29",0]
["DEV",1090,"소중한 첫번째 방","Room_1090",16,"Room_icon_1",1,1,"주얼",{"$f":"INDEX('NO_Table Parameter'!$G:$G,MATCH(I95,'NO_Table Parameter'!$H:$H,0))","v":4},1000,"Blueprint16_Room1","Blueprint16_Room1_icon","2023-03-02T05:50:10 +09:00","2022-09-29",0]
["DEV",1091,"상쾌한 편백나무 방","Room_1091",16,"Room_icon_2",0,2,"주얼",{"$f":"INDEX('NO_Table Parameter'!$G:$G,MATCH(I96,'NO_Table Parameter'!$H:$H,0))","v":4},1000,"Blueprint16_Room2","Blueprint16_Room2_icon","2023-03-02T05:50:10 +09:00","2022-09-29",0]
["DEV",1092,"쾌적한 응접방","Room_1092",16,"Room_icon_3",0,3,"주얼",{"$f":"INDEX('NO_Table Parameter'!$G:$G,MATCH(I97,'NO_Table Parameter'!$H:$H,0))","v":4},1000,"Blueprint16_Room3","Blueprint16_Room3_icon","2023-03-02T05:50:10 +09:00","2022-09-29",0]
["DEV",1093,"따스한 남향 방","Room_1093",16,"Room_icon_4",0,4,"주얼",{"$f":"INDEX('NO_Table Parameter'!$G:$G,MATCH(I98,'NO_Table Parameter'!$H:$H,0))","v":4},1000,"Blueprint16_Room4","Blueprint16_Room4_icon","2023-03-02T05:50:10 +09:00","2022-09-29",0]
["DEV",1094,"힐링 구들방","Room_1094",16,"Room_icon_5",0,5,"주얼",{"$f":"INDEX('NO_Table Parameter'!$G:$G,MATCH(I99,'NO_Table Parameter'!$H:$H,0))","v":4},1000,"Blueprint16_Room5","Blueprint16_Room5_icon","2023-03-02T05:50:10 +09:00","2022-09-29",0]
["DEV",1095,"라스트 모퉁이 방","Room_1095",16,"Room_icon_6",0,6,"주얼",{"$f":"INDEX('NO_Table Parameter'!$G:$G,MATCH(I100,'NO_Table Parameter'!$H:$H,0))","v":4},1000,"Blueprint16_Room6","Blueprint16_Room6_icon","2023-03-02T05:50:10 +09:00","2022-09-29",0]
["DEV",1096,"소중한 첫번째 방","Room_1096",17,"Room_icon_1",1,1,"주얼",{"$f":"INDEX('NO_Table Parameter'!$G:$G,MATCH(I101,'NO_Table Parameter'!$H:$H,0))","v":4},1000,"Blueprint9_Room1","Blueprint9_Room1_icon","2023-03-02T05:50:10 +09:00","2022-09-29",0]
["DEV",1097,"쾌적한 브런치 공간","Room_1097",17,"Room_icon_2",0,2,"주얼",{"$f":"INDEX('NO_Table Parameter'!$G:$G,MATCH(I102,'NO_Table Parameter'!$H:$H,0))","v":4},1000,"Blueprint9_Room2","Blueprint9_Room2_icon","2023-03-02T05:50:10 +09:00","2022-09-29",0]
["DEV",1098,"산뜻한 뱀부 룸","Room_1098",17,"Room_icon_3",0,3,"주얼",{"$f":"INDEX('NO_Table Parameter'!$G:$G,MATCH(I103,'NO_Table Parameter'!$H:$H,0))","v":4},1000,"Blueprint9_Room3","Blueprint9_Room3_icon","2023-03-02T05:50:10 +09:00","2022-09-29",0]
["DEV",1099,"2층 메인공간","Room_1099",17,"Room_icon_4",0,4,"주얼",{"$f":"INDEX('NO_Table Parameter'!$G:$G,MATCH(I104,'NO_Table Parameter'!$H:$H,0))","v":4},1000,"Blueprint9_Room4","Blueprint9_Room4_icon","2023-03-02T05:50:10 +09:00","2022-09-29",0]
["DEV",1100,"안락한 2층 방","Room_1100",17,"Room_icon_5",0,5,"주얼",{"$f":"INDEX('NO_Table Parameter'!$G:$G,MATCH(I105,'NO_Table Parameter'!$H:$H,0))","v":4},1000,"Blueprint9_Room5","Blueprint9_Room5_icon","2023-03-02T05:50:10 +09:00","2022-09-29",0]
["DEV",1101,"라스트 모퉁이 방","Room_1101",17,"Room_icon_6",0,6,"주얼",{"$f":"INDEX('NO_Table Parameter'!$G:$G,MATCH(I106,'NO_Table Parameter'!$H:$H,0))","v":4},1000,"Blueprint9_Room6","Blueprint9_Room6_icon","2023-03-02T05:50:10 +09:00","2022-09-29",0]
["DEV",1102,"소중한 첫번째 방","Room_1102",18,"Room_icon_1",1,1,"주얼",{"$f":"INDEX('NO_Table Parameter'!$G:$G,MATCH(I107,'NO_Table Parameter'!$H:$H,0))","v":4},1000,"Blueprint17_Room1","Blueprint17_Room1_icon","2023-03-02T05:50:10 +09:00","2022-09-29",0]
["DEV",1103,"쾌적한 브런치 공간","Room_1103",18,"Room_icon_2",0,2,"주얼",{"$f":"INDEX('NO_Table Parameter'!$G:$G,MATCH(I108,'NO_Table Parameter'!$H:$H,0))","v":4},1000,"Blueprint17_Room2","Blueprint17_Room2_icon","2023-03-02T05:50:10 +09:00","2022-09-29",0]
["DEV",1104,"끝자락 또다른 방","Room_1104",18,"Room_icon_3",0,3,"주얼",{"$f":"INDEX('NO_Table Parameter'!$G:$G,MATCH(I109,'NO_Table Parameter'!$H:$H,0))","v":4},1000,"Blueprint17_Room3","Blueprint17_Room3_icon","2023-03-02T05:50:10 +09:00","2022-09-29",0]
["DEV",1105,"첫번째 2층 방","Room_1105",18,"Room_icon_4",0,4,"주얼",{"$f":"INDEX('NO_Table Parameter'!$G:$G,MATCH(I110,'NO_Table Parameter'!$H:$H,0))","v":4},1000,"Blueprint17_Room4","Blueprint17_Room4_icon","2023-03-02T05:50:10 +09:00","2022-09-29",0]
["DEV",1106,"두번째 2층 방","Room_1106",18,"Room_icon_5",0,5,"주얼",{"$f":"INDEX('NO_Table Parameter'!$G:$G,MATCH(I111,'NO_Table Parameter'!$H:$H,0))","v":4},1000,"Blueprint17_Room5","Blueprint17_Room5_icon","2023-03-02T05:50:10 +09:00","2022-09-29",0]
["DEV",1107,"라스트 모퉁이 방","Room_1107",18,"Room_icon_6",0,6,"주얼",{"$f":"INDEX('NO_Table Parameter'!$G:$G,MATCH(I112,'NO_Table Parameter'!$H:$H,0))","v":4},1000,"Blueprint17_Room6","Blueprint17_Room6_icon","2023-03-02T05:50:10 +09:00","2022-09-29",0]
["DEV",1108,"메인 홀","Room_1108",19,"Room_icon_1",1,1,"주얼",{"$f":"INDEX('NO_Table Parameter'!$G:$G,MATCH(I113,'NO_Table Parameter'!$H:$H,0))","v":4},1000,"Blueprint18_Room1","Blueprint18_Room1_icon","2023-03-02T05:50:10 +09:00","2022-09-29",0]
["DEV",1109,"조용한 접대실","Room_1109",19,"Room_icon_2",0,2,"주얼",{"$f":"INDEX('NO_Table Parameter'!$G:$G,MATCH(I114,'NO_Table Parameter'!$H:$H,0))","v":4},1000,"Blueprint18_Room2","Blueprint18_Room2_icon","2023-03-02T05:50:10 +09:00","2022-09-29",0]
["DEV",1110,"가문의 갤러리 공간","Room_1110",19,"Room_icon_3",0,3,"주얼",{"$f":"INDEX('NO_Table Parameter'!$G:$G,MATCH(I115,'NO_Table Parameter'!$H:$H,0))","v":4},1000,"Blueprint18_Room3","Blueprint18_Room3_icon","2023-03-02T05:50:10 +09:00","2022-09-29",0]
["DEV",1111,"첫번째 2층 방","Room_1111",19,"Room_icon_4",0,4,"주얼",{"$f":"INDEX('NO_Table Parameter'!$G:$G,MATCH(I116,'NO_Table Parameter'!$H:$H,0))","v":4},1000,"Blueprint18_Room4","Blueprint18_Room4_icon","2023-03-02T05:50:10 +09:00","2022-09-29",0]
["DEV",1112,"두번째 2층 방","Room_1112",19,"Room_icon_5",0,5,"주얼",{"$f":"INDEX('NO_Table Parameter'!$G:$G,MATCH(I117,'NO_Table Parameter'!$H:$H,0))","v":4},1000,"Blueprint18_Room5","Blueprint18_Room5_icon","2023-03-02T05:50:10 +09:00","2022-09-29",0]
["DEV",1113,"라스트 주인의 방","Room_1113",19,"Room_icon_6",0,6,"주얼",{"$f":"INDEX('NO_Table Parameter'!$G:$G,MATCH(I118,'NO_Table Parameter'!$H:$H,0))","v":4},1000,"Blueprint18_Room6","Blueprint18_Room6_icon","2023-03-02T05:50:10 +09:00","2022-09-29",0]
["DEV",1114,"메인 홀","Room_1114",20,"Room_icon_1",1,1,"주얼",{"$f":"INDEX('NO_Table Parameter'!$G:$G,MATCH(I119,'NO_Table Parameter'!$H:$H,0))","v":4},1000,"Blueprint19_Room1","Blueprint19_Room1_icon","2023-03-02T05:50:10 +09:00","2022-09-29",0]
["DEV",1115,"조용한 접대실","Room_1115",20,"Room_icon_2",0,2,"주얼",{"$f":"INDEX('NO_Table Parameter'!$G:$G,MATCH(I120,'NO_Table Parameter'!$H:$H,0))","v":4},1000,"Blueprint19_Room2","Blueprint19_Room2_icon","2023-03-02T05:50:10 +09:00","2022-09-29",0]
["DEV",1116,"가문의 갤러리 공간","Room_1116",20,"Room_icon_3",0,3,"주얼",{"$f":"INDEX('NO_Table Parameter'!$G:$G,MATCH(I121,'NO_Table Parameter'!$H:$H,0))","v":4},1000,"Blueprint19_Room3","Blueprint19_Room3_icon","2023-03-02T05:50:10 +09:00","2022-09-29",0]
["DEV",1117,"첫번째 2층 방","Room_1117",20,"Room_icon_4",0,4,"주얼",{"$f":"INDEX('NO_Table Parameter'!$G:$G,MATCH(I122,'NO_Table Parameter'!$H:$H,0))","v":4},1000,"Blueprint19_Room4","Blueprint19_Room4_icon","2023-03-02T05:50:10 +09:00","2022-09-29",0]
["DEV",1118,"두번째 2층 방","Room_1118",20,"Room_icon_5",0,5,"주얼",{"$f":"INDEX('NO_Table Parameter'!$G:$G,MATCH(I123,'NO_Table Parameter'!$H:$H,0))","v":4},1000,"Blueprint19_Room5","Blueprint19_Room5_icon","2023-03-02T05:50:10 +09:00","2022-09-29",0]
["DEV",1119,"라스트 주인의 방","Room_1119",20,"Room_icon_6",0,6,"주얼",{"$f":"INDEX('NO_Table Parameter'!$G:$G,MATCH(I124,'NO_Table Parameter'!$H:$H,0))","v":4},1000,"Blueprint19_Room6","Blueprint19_Room6_icon","2023-03-02T05:50:10 +09:00","2022-09-29",0]

{"sheet":"Yard","index":3,"n_rows":15,"n_cols":13,"rows_kept":15,"cut":false,"hidden":false,"merged":[]}
["ServiceType","Key","FieldID","#YardName","YardName","IconID","IsBase","OpenSortIndex","OpenGroupID","ConsumeMatGroupID","OpenTime","#LiveDate","#UpdateVersion"]
["string","int","int","none","stringkey","string","bool","int","int","int","datetime","none","Client"]
["All","All","All","Client","Client","Client","Client","Client","All","All","All","Client","none"]
["서비스 타입","마당 ID","구역 ID","마당명","스트링 코드명","아이콘 ID","기본 마당 여부","오픈 순서","오픈 ID","소모 재료 그룹 ID","오픈 시간","출시 일자","업데이트 버전"]
["DEV",1000000,100,"마당: 3층 하우스 1","Yard_1000000","Yard_icon_1000000",1,1,null,null,"2023-03-02T05:50:10 +09:00","2022-09-29"]
["DEV",1000001,100,"마당: 3층 하우스 2","Yard_1000001","Yard_icon_1000000",0,2,null,null,"2023-03-02T05:50:10 +09:00","2022-09-29"]
["DEV",1000002,100,"마당: 3층 하우스 3","Yard_1000002","Yard_icon_1000000",0,3,null,null,"2023-03-02T05:50:10 +09:00","2022-09-29"]
["DEV",1000003,100,"마당: 3층 하우스 4","Yard_1000003","Yard_icon_1000000",0,4,null,null,"2023-03-02T05:50:10 +09:00","2022-09-29"]
["DEV",1000004,100,"마당: 3층 하우스 5","Yard_1000004","Yard_icon_1000000",0,5,null,null,"2023-03-02T05:50:10 +09:00","2022-09-29"]
["DEV",1000006,101,"마당: 1층이 넓은 하우스 1","Yard_1000006","Yard_icon_1000000",1,1,null,null,"2023-03-02T05:50:10 +09:00","2022-09-29"]
["DEV",1000007,101,"마당: 1층이 넓은 하우스 2","Yard_1000007","Yard_icon_1000000",0,2,22,1,"2023-03-02T05:50:10 +09:00","2022-09-29"]
["DEV",1000008,101,"마당: 1층이 넓은 하우스 3","Yard_1000008","Yard_icon_1000000",0,3,23,1,"2023-03-02T05:50:10 +09:00","2022-09-29"]
["DEV",1000009,101,"마당: 1층이 넓은 하우스 4","Yard_1000009","Yard_icon_1000000",0,4,24,1,"2023-03-02T05:50:10 +09:00","2022-09-29"]
["DEV",1000010,101,"마당: 1층이 넓은 하우스 5","Yard_1000010","Yard_icon_1000000",0,5,25,1,"2023-03-02T05:50:10 +09:00","2022-09-29"]
["DEV",1000011,101,"마당: 1층이 넓은 하우스 6","Yard_1000011","Yard_icon_1000000",0,6,26,1,"2023-03-02T05:50:10 +09:00","2022-09-29"]

{"sheet":"Field","index":4,"n_rows":17,"n_cols":22,"rows_kept":17,"cut":false,"hidden":false,"merged":[]}
["ServiceType","Key","#FieldName","FieldName","IconID","FieldImage","IsSquare","IsHouse","BGMPrefabName","NightBGMPrefabName","CityID","IsShortcut","#IconTag","IconTag","FieldPrefabName","IsShortcutPopup","#EPlaceShortcutType","PlaceShortcutType","PlaceShortcutTypeString","OpenTime","#LiveDate","#UpdateVersion"]
["string","int","none","stringkey","none","string","bool","bool","string","string","int","bool","none","int","string","bool","none","EPlaceShortcutType","string","datetime","none","Client"]
["All","All","Client","Client","Client","Client","All","All","All","All","All","All","Client","Client","Client","Client","Client","Client","Client","All","Client","none"]
["서비스 타입","구역 ID","구역명","스트링 코드명","아이콘 ID","이미지명","광장 여부","하우스 여부","BGM 프리팹명","(밤) BGM 프리팹명 ","시티 ID","지도 숏컷 표시 여부","숏컷 아이콘 표시 ","숏컷 아이콘 표시","프리팹명","숏컷 팝업 출력 여부","숏컷 장소 종류","숏컷 장소 종류","숏컷 장소 스트링","오픈 시간","출시 일자","업데이트 버전"]
["DEV",100,"트로피칼 선 스테이트 하우스",{"$f":"INDEX([3]KOR_StringTable!$B:$B,MATCH(C5,[3]KOR_StringTable!$C:$C,0))","v":"Field_100"},"Field100_icon","Field100_image",0,1,"BGM_Vacation","BGM_Vacation_N",3,0,"없음",{"$f":"INDEX('NO_Table Parameter'!$J:$J,MATCH(M5,'NO_Table Parameter'!$K:$K,0))","v":0},"Field100",1,"마이 하우스",{"$f":"IFERROR(INDEX('NO_Table Parameter'!$M:$M,MATCH(Q5,'NO_Table Parameter'!$N:$N,0)),\"\")","v":1},{"$f":"IFERROR(INDEX([3]KOR_StringTable!$B:$B,MATCH(Q5,[3]KOR_StringTable!$C:$C,0)),\"\")","v":"My_House"},"2023-03-02T05:50:10 +09:00","2022-09-29"]
["DEV",101,"어반뷰 스테이트 하우스",{"$f":"INDEX([3]KOR_StringTable!$B:$B,MATCH(C6,[3]KOR_StringTable!$C:$C,0))","v":"Field_101"},"Field101_icon","Field101_image",0,1,"BGM_City","BGM_City_N",2,0,"없음",{"$f":"INDEX('NO_Table Parameter'!$J:$J,MATCH(M6,'NO_Table Parameter'!$K:$K,0))","v":0},"Field101",1,"마이 하우스",{"$f":"IFERROR(INDEX('NO_Table Parameter'!$M:$M,MATCH(Q6,'NO_Table Parameter'!$N:$N,0)),\"\")","v":1},{"$f":"IFERROR(INDEX([3]KOR_StringTable!$B:$B,MATCH(Q6,[3]KOR_StringTable!$C:$C,0)),\"\")","v":"My_House"},"2023-03-02T05:50:10 +09:00","2022-09-29"]
["DEV",102,"에버그린 스테이트 하우스",{"$f":"INDEX([3]KOR_StringTable!$B:$B,MATCH(C7,[3]KOR_StringTable!$C:$C,0))","v":"Field_103"},"Field102_icon","Field102_image",0,1,"BGM_Forest","BGM_Forest_N",1,0,"없음",{"$f":"INDEX('NO_Table Parameter'!$J:$J,MATCH(M7,'NO_Table Parameter'!$K:$K,0))","v":0},"Field102",1,"마이 하우스",{"$f":"IFERROR(INDEX('NO_Table Parameter'!$M:$M,MATCH(Q7,'NO_Table Parameter'!$N:$N,0)),\"\")","v":1},{"$f":"IFERROR(INDEX([3]KOR_StringTable!$B:$B,MATCH(Q7,[3]KOR_StringTable!$C:$C,0)),\"\")","v":"My_House"},"2023-03-02T05:50:10 +09:00","2022-09-29"]
["DEV",103,"퀸즈 팰리스 스테이트 하우스",{"$f":"INDEX([3]KOR_StringTable!$B:$B,MATCH(C8,[3]KOR_StringTable!$C:$C,0))","v":"Field_104"},"Field103_icon","Field103_image",0,1,"BGM_European","BGM_European_N",4,0,"없음",{"$f":"INDEX('NO_Table Parameter'!$J:$J,MATCH(M8,'NO_Table Parameter'!$K:$K,0))","v":0},"Field103",1,"마이 하우스",{"$f":"IFERROR(INDEX('NO_Table Parameter'!$M:$M,MATCH(Q8,'NO_Table Parameter'!$N:$N,0)),\"\")","v":1},{"$f":"IFERROR(INDEX([3]KOR_StringTable!$B:$B,MATCH(Q8,[3]KOR_StringTable!$C:$C,0)),\"\")","v":"My_House"},"2023-03-02T05:50:10 +09:00","2022-09-29"]
["DEV",104,"그린팜",{"$f":"INDEX([3]KOR_StringTable!$B:$B,MATCH(C9,[3]KOR_StringTable!$C:$C,0))","v":"Field_105"},"Field104_icon","Field104_image",0,0,"BGM_European",null,null,0,"없음",{"$f":"INDEX('NO_Table Parameter'!$J:$J,MATCH(M9,'NO_Table Parameter'!$K:$K,0))","v":0},"GreenHouseField104",0,null,{"$f":"IFERROR(INDEX('NO_Table Parameter'!$M:$M,MATCH(Q9,'NO_Table Parameter'!$N:$N,0)),\"\")","v":""},{"$f":"IFERROR(INDEX([3]KOR_StringTable!$B:$B,MATCH(Q9,[3]KOR_StringTable!$C:$C,0)),\"\")","v":""},"2023-03-02T05:50:10 +09:00","2022-09-29"]
["DEV",105,"센트럴 타운",{"$f":"INDEX([3]KOR_StringTable!$B:$B,MATCH(C10,[3]KOR_StringTable!$C:$C,0))","v":"CentralTown"},"Field105_icon","Field105_image",1,0,"BGM_CentralTown","BGM_CentralTown_N",3,0,"없음",{"$f":"INDEX('NO_Table Parameter'!$J:$J,MATCH(M10,'NO_Table Parameter'!$K:$K,0))","v":0},"MissionHouseLobbyField105",1,"만남의 공간",{"$f":"IFERROR(INDEX('NO_Table Parameter'!$M:$M,MATCH(Q10,'NO_Table Parameter'!$N:$N,0)),\"\")","v":3},{"$f":"IFERROR(INDEX([3]KOR_StringTable!$B:$B,MATCH(Q10,[3]KOR_StringTable!$C:$C,0)),\"\")","v":"Plaza"},"2023-03-02T05:50:10 +09:00","2022-09-29"]
["DEV",106,"에버그린 랜드마크",{"$f":"INDEX([3]KOR_StringTable!$B:$B,MATCH(C11,[3]KOR_StringTable!$C:$C,0))","v":"Field_106"},"Field106_icon","Field106_image",1,0,"BGM_EverGreen","BGM_EverGreen_N",2,0,"없음",{"$f":"INDEX('NO_Table Parameter'!$J:$J,MATCH(M11,'NO_Table Parameter'!$K:$K,0))","v":0},"LandMark106",1,"만남의 공간",{"$f":"IFERROR(INDEX('NO_Table Parameter'!$M:$M,MATCH(Q11,'NO_Table Parameter'!$N:$N,0)),\"\")","v":3},{"$f":"IFERROR(INDEX([3]KOR_StringTable!$B:$B,MATCH(Q11,[3]KOR_StringTable!$C:$C,0)),\"\")","v":"Plaza"},"2023-03-02T05:50:10 +09:00","2022-09-29"]
["DEV",107,"퀸즈 팰리스 랜드마크",{"$f":"INDEX([3]KOR_StringTable!$B:$B,MATCH(C12,[3]KOR_StringTable!$C:$C,0))","v":"Field_107"},"Field107_icon","Field107_image",1,0,"BGM_QueenPalace","BGM_QueenPalace_N",1,0,"없음",{"$f":"INDEX('NO_Table Parameter'!$J:$J,MATCH(M12,'NO_Table Parameter'!$K:$K,0))","v":0},"QueensPalaceLandMark001",0,null,{"$f":"IFERROR(INDEX('NO_Table Parameter'!$M:$M,MATCH(Q12,'NO_Table Parameter'!$N:$N,0)),\"\")","v":""},{"$f":"IFERROR(INDEX([3]KOR_StringTable!$B:$B,MATCH(Q12,[3]KOR_StringTable!$C:$C,0)),\"\")","v":""},"2023-03-02T05:50:10 +09:00","2022-09-29"]
["DEV",108,"패션 스트릿",{"$f":"INDEX([3]KOR_StringTable!$B:$B,MATCH(C13,[3]KOR_StringTable!$C:$C,0))","v":"Zone_104"},"Field108_icon","Field108_image",1,0,"BGM_FashionStreet","BGM_FashionStreet_N",4,0,"없음",{"$f":"INDEX('NO_Table Parameter'!$J:$J,MATCH(M13,'NO_Table Parameter'!$K:$K,0))","v":0},"PashionStreet001",1,"만남의 공간",{"$f":"IFERROR(INDEX('NO_Table Parameter'!$M:$M,MATCH(Q13,'NO_Table Parameter'!$N:$N,0)),\"\")","v":3},{"$f":"IFERROR(INDEX([3]KOR_StringTable!$B:$B,MATCH(Q13,[3]KOR_StringTable!$C:$C,0)),\"\")","v":"Plaza"},"2023-03-02T05:50:10 +09:00","2022-09-29"]
["DEV",109,"그리너리 시티 빌리지",{"$f":"INDEX([3]KOR_StringTable!$B:$B,MATCH(C14,[3]KOR_StringTable!$C:$C,0))","v":"Field_109"},"Field109_icon","Field109_image",1,0,null,null,1,0,"없음",{"$f":"INDEX('NO_Table Parameter'!$J:$J,MATCH(M14,'NO_Table Parameter'!$K:$K,0))","v":0},"Village000001",1,"마이 빌리지",{"$f":"IFERROR(INDEX('NO_Table Parameter'!$M:$M,MATCH(Q14,'NO_Table Parameter'!$N:$N,0)),\"\")","v":2},{"$f":"IFERROR(INDEX([3]KOR_StringTable!$B:$B,MATCH(Q14,[3]KOR_StringTable!$C:$C,0)),\"\")","v":"My_Village"},"2023-03-02T05:50:10 +09:00","2022-09-29"]
["DEV",110,"어반뷰 시티 빌리지",{"$f":"INDEX([3]KOR_StringTable!$B:$B,MATCH(C15,[3]KOR_StringTable!$C:$C,0))","v":"Field_110"},"Field110_icon","Field110_image",1,0,null,null,2,0,"없음",{"$f":"INDEX('NO_Table Parameter'!$J:$J,MATCH(M15,'NO_Table Parameter'!$K:$K,0))","v":0},"Village000002",1,"마이 빌리지",{"$f":"IFERROR(INDEX('NO_Table Parameter'!$M:$M,MATCH(Q15,'NO_Table Parameter'!$N:$N,0)),\"\")","v":2},{"$f":"IFERROR(INDEX([3]KOR_StringTable!$B:$B,MATCH(Q15,[3]KOR_StringTable!$C:$C,0)),\"\")","v":"My_Village"},"2023-03-02T05:50:10 +09:00","2022-09-29"]
["DEV",111,"트로피칼 선 시티 빌리지",{"$f":"INDEX([3]KOR_StringTable!$B:$B,MATCH(C16,[3]KOR_StringTable!$C:$C,0))","v":"Field_111"},"Field111_icon","Field111_image",1,0,null,null,3,0,"없음",{"$f":"INDEX('NO_Table Parameter'!$J:$J,MATCH(M16,'NO_Table Parameter'!$K:$K,0))","v":0},"Village000003",1,"마이 빌리지",{"$f":"IFERROR(INDEX('NO_Table Parameter'!$M:$M,MATCH(Q16,'NO_Table Parameter'!$N:$N,0)),\"\")","v":2},{"$f":"IFERROR(INDEX([3]KOR_StringTable!$B:$B,MATCH(Q16,[3]KOR_StringTable!$C:$C,0)),\"\")","v":"My_Village"},"2023-03-02T05:50:10 +09:00","2022-09-29"]
["DEV",112,"퀸즈 팰리스 시티 빌리지",{"$f":"INDEX([3]KOR_StringTable!$B:$B,MATCH(C17,[3]KOR_StringTable!$C:$C,0))","v":"Field_112"},"Field112_icon","Field112_image",1,0,null,null,4,0,"없음",{"$f":"INDEX('NO_Table Parameter'!$J:$J,MATCH(M17,'NO_Table Parameter'!$K:$K,0))","v":0},"Village000004",1,"마이 빌리지",{"$f":"IFERROR(INDEX('NO_Table Parameter'!$M:$M,MATCH(Q17,'NO_Table Parameter'!$N:$N,0)),\"\")","v":2},{"$f":"IFERROR(INDEX([3]KOR_StringTable!$B:$B,MATCH(Q17,[3]KOR_StringTable!$C:$C,0)),\"\")","v":"My_Village"},"2023-03-02T05:50:10 +09:00","2022-09-29"]

{"sheet":"SaveRoom","index":5,"n_rows":20,"n_cols":12,"rows_kept":20,"cut":false,"hidden":false,"merged":[]}
["ServiceType","Key","#FieldName","FieldID","Sortindex","#BuyPriceType","BuyPriceType","BuyPriceValue","IsShow","OpenTime","#LiveDate","#UpdateVersion"]
["string","int","none","int","int","none","ERewardType","int","int","datetime","none","none"]
["All","All","Client","All","Client","All","All","All","All","All","Client","Client"]
["서비스 타입","저장룸 ID","구역명","구역 ID","순서","구매재화종류","구매재화종류","재화 값","표시 여부","오픈 시간","출시 일자","업데이트 버전"]
["DEV",1000000,"에버그린 스테이트 하우스",{"$f":"IF(ISTEXT(C5),INDEX(Field!$B$5:$B$1048576,MATCH(SaveRoom!C5,Field!$C$5:$C$1048576,0)),\"\")","v":102},1,"골드",{"$f":"INDEX('NO_Table Parameter'!$G:$G,MATCH(F5,'NO_Table Parameter'!$H:$H,0))","v":1},1000000,1,"2023-03-02T05:50:10 +09:00","2022-11-10",0]
["DEV",1000001,"에버그린 스테이트 하우스",{"$f":"IF(ISTEXT(C6),INDEX(Field!$B$5:$B$1048576,MATCH(SaveRoom!C6,Field!$C$5:$C$1048576,0)),\"\")","v":102},2,"주얼",{"$f":"INDEX('NO_Table Parameter'!$G:$G,MATCH(F6,'NO_Table Parameter'!$H:$H,0))","v":4},100,1,"2023-03-02T05:50:10 +09:00","2022-11-10",0]
["DEV",1000002,"에버그린 스테이트 하우스",{"$f":"IF(ISTEXT(C7),INDEX(Field!$B$5:$B$1048576,MATCH(SaveRoom!C7,Field!$C$5:$C$1048576,0)),\"\")","v":102},3,"주얼",{"$f":"INDEX('NO_Table Parameter'!$G:$G,MATCH(F7,'NO_Table Parameter'!$H:$H,0))","v":4},100,1,"2023-03-02T05:50:10 +09:00","2022-11-10",0]
["DEV",1000003,"에버그린 스테이트 하우스",{"$f":"IF(ISTEXT(C8),INDEX(Field!$B$5:$B$1048576,MATCH(SaveRoom!C8,Field!$C$5:$C$1048576,0)),\"\")","v":102},4,"주얼",{"$f":"INDEX('NO_Table Parameter'!$G:$G,MATCH(F8,'NO_Table Parameter'!$H:$H,0))","v":4},100,1,"2023-03-02T05:50:10 +09:00","2022-11-10",0]
["DEV",1000004,"어반뷰 스테이트 하우스",{"$f":"IF(ISTEXT(C9),INDEX(Field!$B$5:$B$1048576,MATCH(SaveRoom!C9,Field!$C$5:$C$1048576,0)),\"\")","v":101},1,"골드",{"$f":"INDEX('NO_Table Parameter'!$G:$G,MATCH(F9,'NO_Table Parameter'!$H:$H,0))","v":1},1000000,1,"2023-03-02T05:50:10 +09:00","2022-11-10",0]
["DEV",1000005,"어반뷰 스테이트 하우스",{"$f":"IF(ISTEXT(C10),INDEX(Field!$B$5:$B$1048576,MATCH(SaveRoom!C10,Field!$C$5:$C$1048576,0)),\"\")","v":101},2,"주얼",{"$f":"INDEX('NO_Table Parameter'!$G:$G,MATCH(F10,'NO_Table Parameter'!$H:$H,0))","v":4},100,1,"2023-03-02T05:50:10 +09:00","2022-11-10",0]
["DEV",1000006,"어반뷰 스테이트 하우스",{"$f":"IF(ISTEXT(C11),INDEX(Field!$B$5:$B$1048576,MATCH(SaveRoom!C11,Field!$C$5:$C$1048576,0)),\"\")","v":101},3,"주얼",{"$f":"INDEX('NO_Table Parameter'!$G:$G,MATCH(F11,'NO_Table Parameter'!$H:$H,0))","v":4},100,1,"2023-03-02T05:50:10 +09:00","2022-11-10",0]
["DEV",1000007,"어반뷰 스테이트 하우스",{"$f":"IF(ISTEXT(C12),INDEX(Field!$B$5:$B$1048576,MATCH(SaveRoom!C12,Field!$C$5:$C$1048576,0)),\"\")","v":101},4,"주얼",{"$f":"INDEX('NO_Table Parameter'!$G:$G,MATCH(F12,'NO_Table Parameter'!$H:$H,0))","v":4},100,1,"2023-03-02T05:50:10 +09:00","2022-11-10",0]
["DEV",1000008,"퀸즈 팰리스 스테이트 하우스",{"$f":"IF(ISTEXT(C13),INDEX(Field!$B$5:$B$1048576,MATCH(SaveRoom!C13,Field!$C$5:$C$1048576,0)),\"\")","v":103},1,"골드",{"$f":"INDEX('NO_Table Parameter'!$G:$G,MATCH(F13,'NO_Table Parameter'!$H:$H,0))","v":1},1000000,1,"2023-03-02T05:50:10 +09:00","2022-11-10",0]
["DEV",1000009,"퀸즈 팰리스 스테이트 하우스",{"$f":"IF(ISTEXT(C14),INDEX(Field!$B$5:$B$1048576,MATCH(SaveRoom!C14,Field!$C$5:$C$1048576,0)),\"\")","v":103},2,"주얼",{"$f":"INDEX('NO_Table Parameter'!$G:$G,MATCH(F14,'NO_Table Parameter'!$H:$H,0))","v":4},100,1,"2023-03-02T05:50:10 +09:00","2022-11-10",0]
["DEV",1000010,"퀸즈 팰리스 스테이트 하우스",{"$f":"IF(ISTEXT(C15),INDEX(Field!$B$5:$B$1048576,MATCH(SaveRoom!C15,Field!$C$5:$C$1048576,0)),\"\")","v":103},3,"주얼",{"$f":"INDEX('NO_Table Parameter'!$G:$G,MATCH(F15,'NO_Table Parameter'!$H:$H,0))","v":4},100,1,"2023-03-02T05:50:10 +09:00","2022-11-10",0]
["DEV",1000011,"퀸즈 팰리스 스테이트 하우스",{"$f":"IF(ISTEXT(C16),INDEX(Field!$B$5:$B$1048576,MATCH(SaveRoom!C16,Field!$C$5:$C$1048576,0)),\"\")","v":103},4,"주얼",{"$f":"INDEX('NO_Table Parameter'!$G:$G,MATCH(F16,'NO_Table Parameter'!$H:$H,0))","v":4},100,1,"2023-03-02T05:50:10 +09:00","2022-11-10",0]
["DEV",1000012,"트로피칼 선 스테이트 하우스",{"$f":"IF(ISTEXT(C17),INDEX(Field!$B$5:$B$1048576,MATCH(SaveRoom!C17,Field!$C$5:$C$1048576,0)),\"\")","v":100},1,"골드",{"$f":"INDEX('NO_Table Parameter'!$G:$G,MATCH(F17,'NO_Table Parameter'!$H:$H,0))","v":1},1000000,1,"2023-03-02T05:50:10 +09:00","2022-11-10",0]
["DEV",1000013,"트로피칼 선 스테이트 하우스",{"$f":"IF(ISTEXT(C18),INDEX(Field!$B$5:$B$1048576,MATCH(SaveRoom!C18,Field!$C$5:$C$1048576,0)),\"\")","v":100},2,"주얼",{"$f":"INDEX('NO_Table Parameter'!$G:$G,MATCH(F18,'NO_Table Parameter'!$H:$H,0))","v":4},100,1,"2023-03-02T05:50:10 +09:00","2022-11-10",0]
["DEV",1000014,"트로피칼 선 스테이트 하우스",{"$f":"IF(ISTEXT(C19),INDEX(Field!$B$5:$B$1048576,MATCH(SaveRoom!C19,Field!$C$5:$C$1048576,0)),\"\")","v":100},3,"주얼",{"$f":"INDEX('NO_Table Parameter'!$G:$G,MATCH(F19,'NO_Table Parameter'!$H:$H,0))","v":4},100,1,"2023-03-02T05:50:10 +09:00","2022-11-10",0]
["DEV",1000015,"트로피칼 선 스테이트 하우스",{"$f":"IF(ISTEXT(C20),INDEX(Field!$B$5:$B$1048576,MATCH(SaveRoom!C20,Field!$C$5:$C$1048576,0)),\"\")","v":100},4,"주얼",{"$f":"INDEX('NO_Table Parameter'!$G:$G,MATCH(F20,'NO_Table Parameter'!$H:$H,0))","v":4},100,1,"2023-03-02T05:50:10 +09:00","2022-11-10",0]