{"text_format":"1","workbook":"xlsx","n_sheets":6,"sheets":["NO_Table Parameter","Blueprint","Room","Yard","Field","SaveRoom"],"not_rendered":{"charts":0,"images":0,"macros":1,"external_links":3,"defined_names":1,"comments":0,"pivot_tables":0},"unopened":[],"bounds":{"document_bytes":16777216,"sheet_cells":100000,"rows_first":2000,"rows_last":500,"rows_between":2000,"halvings":0,"cell_chars":16384,"cell_head_chars":4096},"cells_cut":0,"cells_raw":0,"read":"whole","date_system":"1900"}

{"sheet":"NO_Table Parameter","index":0,"n_rows":41,"n_cols":14,"rows_kept":41,"cut":false,"hidden":false,"merged":[]}
[null,null,null,null,null,null,null,null,null,null,null,null,"[PF_EnumTypeData.xlsm]EPlaceShortcutType!Key","[PF_EnumTypeData.xlsm]EPlaceShortcutType!Desc"]
["BlueprintTable",null,null,null,null,null,"ERewardType",null,null,"EIconTag",null,null,"열거형 숫자","요약"]
["칼럼 영문명","자료형","칼럼 한글명","참조 테이블","설명",null,"ID","String",null,"ID","enum",null,1,"마이 하우스"]
["Key","int","도면 ID",null,"도면의 고유 주소 기재",null,1,"골드",null,0,"없음",null,2,"마이 빌리지"]
["BlueprintName","stringkey","스트링 코드명",null,"도면명 기재",null,2,"무료 주얼",null,1,"new",null,3,"만남의 공간"]
["IconID","string","아이콘 ID",null,"아이콘 ID 기재",null,3,"유료 주얼",null,2,"evnet",null,4,"특별관"]
["SortIndex","int","순서",null,"팝업창에 보여지는 순서 기재",null,4,"주얼",null,3,"premium"]
["IsSpecial","bool","특별 도면 여부",null,"스테이트별 스페셜 도면 여부",null,5,"하트",null,4,"hot"]
["SpecialFieldType","int","전용 필드 ID",null,"스페셜 도면의 스테이트 기입",null,6,"위시"]
["BuyPriceType","ERewardType","구매재화종류",null,"구매 재화 종류 기입",null,7,"패션"]
["BuyPriceValue","int","구매 값",null,"구매 재화 값 기입",null,8,"피스"]
[null,null,null,null,null,null,9,"기빙"]
["RoomTable",null,null,null,null,null,10,"경험치"]
["칼럼 영문명","자료형","칼럼 한글명","참조 테이블","설명",null,11,"호감도"]
["Key","int","룸 ID",null,"룸의 고유 주소 기재",null,12,"드릴"]
{"$rows_left_out":27}
{"sheet":"Blueprint","index":1,"n_rows":24,"n_cols":13,"rows_kept":24,"cut":false,"hidden":false,"merged":[]}
["ServiceType","Key","#BlueprintName","BlueprintName","IconID","SortIndex","FieldLimitType","#BuyPriceType","BuyPriceType","BuyPriceValue","OpenTime","#LiveDate","#UpdateVersion"]
["string","int","none","stringkey","string","int","int[]","none","ERewardType","int","datetime","none","Client"]
["All","All","Client","Client","Client","Client","Client","All","All","All","All","Client","none"]
["서비스 타입","도면 ID","도면명","스트링 코드명","아이콘 ID","순서","설치 제한 필드 ID","구매재화종류","구매재화종류","구매 값","오픈 시간","출시 일자","업데이트 버전"]
["DEV",1,"깔끔한 기본형 하우스","Blueprint_1","Blueprint_icon_1",1,{"$f":"IF(ISTEXT(#REF!),LEFT(#REF!,FIND(\":\",#REF!)-1),\"\")","v":""},"골드",{"$f":"INDEX('NO_Table Parameter'!$G:$G,MATCH(H5,'NO_Table Parameter'!$H:$H,0))","v":1},1000000,"2023-03-02T05:50:10 +09:00","2022-09-29",0]
["DEV",2,"기본형 필로티 하우스","Blueprint_2","Blueprint_icon_2",2,"100|101","골드",{"$f":"INDEX('NO_Table Parameter'!$G:$G,MATCH(H6,'NO_Table Parameter'!$H:$H,0))","v":1},1000000,"2023-03-02T05:50:10 +09:00","2022-09-29",0]
["DEV",3,"Q자형 필로티 하우스","Blueprint_3","Blueprint_icon_3",3,102,"골드",{"$f":"INDEX('NO_Table Parameter'!$G:$G,MATCH(H7,'NO_Table Parameter'!$H:$H,0))","v":1},1000000,"2023-03-02T05:50:10 +09:00","2022-09-29",0]
["DEV",4,"기본형 테트리스 하우스","Blueprint_4","Blueprint_icon_4",4,{"$f":"IF(ISTEXT(#REF!),LEFT(#REF!,FIND(\":\",#REF!)-1),\"\")","v":""},"골드",{"$f":"INDEX('NO_Table Parameter'!$G:$G,MATCH(H8,'NO_Table Parameter'!$H:$H,0))","v":1},1000000,"2023-03-02T05:50:10 +09:00","2022-09-29",0]
["DEV",5,"기본형 넓은 다락 하우스","Blueprint_5","Blueprint_icon_5",5,{"$f":"IF(ISTEXT(#REF!),LEFT(#REF!,FIND(\":\",#REF!)-1),\"\")","v":""},"골드",{"$f":"INDEX('NO_Table Parameter'!$G:$G,MATCH(H9,'NO_Table Parameter'!$H:$H,0))","v":1},1000000,"2023-03-02T05:50:10 +09:00","2022-09-29",0]
["DEV",6,"기본형 방갈로 하우스","Blueprint_6","Blueprint_icon_6",6,{"$f":"IF(ISTEXT(#REF!),LEFT(#REF!,FIND(\":\",#REF!)-1),\"\")","v":""},"골드",{"$f":"INDEX('NO_Table Parameter'!$G:$G,MATCH(H10,'NO_Table Parameter'!$H:$H,0))","v":1},1000000,"2023-03-02T05:50:10 +09:00","2022-09-29",0]
["DEV",7,"2단 필로티 하우스","Blueprint_7","Blueprint_icon_7",7,{"$f":"IF(ISTEXT(#REF!),LEFT(#REF!,FIND(\":\",#REF!)-1),\"\")","v":""},"골드",{"$f":"INDEX('NO_Table Parameter'!$G:$G,MATCH(H11,'NO_Table Parameter'!$H:$H,0))","v":1},1000000,"2023-03-02T05:50:10 +09:00","2022-09-29",0]
["DEV",8,"길다란 베이빌라 하우스","Blueprint_8","Blueprint_icon_8",8,{"$f":"IF(ISTEXT(#REF!),LEFT(#REF!,FIND(\":\",#REF!)-1),\"\")","v":""},"골드",{"$f":"INDEX('NO_Table Parameter'!$G:$G,MATCH(H12,'NO_Table Parameter'!$H:$H,0))","v":1},1000000,"2023-03-02T05:50:10 +09:00","2022-09-29",0]
["DEV",9,"다락이 있는 기본형 하우스","Blueprint_9","Blueprint_icon_9",9,{"$f":"IF(ISTEXT(#REF!),LEFT(#REF!,FIND(\":\",#REF!)-1),\"\")","v":""},"골드",{"$f":"INDEX('NO_Table Parameter'!$G:$G,MATCH(H13,'NO_Table Parameter'!$H:$H,0))","v":1},1000000,"2023-03-02T05:50:10 +09:00","2022-09-29",0]
["DEV",10,"나락한 2단 하우스","Blueprint_10","Blueprint_icon_10",10,{"$f":"IF(ISTEXT(#REF!),LEFT(#REF!,FIND(\":\",#REF!)-1),\"\")","v":""},"골드",{"$f":"INDEX('NO_Table Parameter'!$G:$G,MATCH(H14,'NO_Table Parameter'!$H:$H,0))","v":1},1000000,"2023-03-02T05:50:10 +09:00","2022-09-29",0]
["DEV",11,"L자형 프렌치 하우스","Blueprint_11","Blueprint_icon_11",11,{"$f":"IF(ISTEXT(#REF!),LEFT(#REF!,FIND(\":\",#REF!)-1),\"\")","v":""},"골드",{"$f":"INDEX('NO_Table Parameter'!$G:$G,MATCH(H15,'NO_Table Parameter'!$H:$H,0))","v":1},1000000,"2023-03-02T05:50:10 +09:00","2022-09-29",0]
{"$rows_left_out":10}
{"sheet":"Room","index":2,"n_rows":124,"n_cols":16,"rows_kept":124,"cut":false,"hidden":false,"merged":[]}
["ServiceType","Key","#RoomName","RoomName","BlueprintID","IconID","IsBase","OpenSortIndex","#BuyPriceType","BuyPriceType","BuyPriceValue","FieldPrefabName","HouseSkinIconName","OpenTime","#LiveDate","#UpdateVersion"]
["string","int","none","stringkey","int","string","bool","int","none","ERewardType","int","string","string","datetime","none","Client"]
["All","All","Client","Client","All","Client","Client","Client","All","All","All","Client","Client","All","Client","none"]
["서비스 타입","룸 ID","룸명","스트링 코드명","도면 ID","룸 아이콘 ID","기본 룸 여부","오픈 순서","구매재화종류","구매재화종류","구매 값","프리팹명","하우스 외형 아이콘명","오픈 시간","출시 일자","업데이트 버전"]
["DEV",1000,"소중한 첫번째 방","Room_1000",1,"Room_icon_1",1,1,"주얼",{"$f":"INDEX('NO_Table Parameter'!$G:$G,MATCH(I5,'NO_Table Parameter'!$H:$H,0))","v":4},1000,"Blueprint1_Room1","Blueprint1_Room1_icon","2023-03-02T05:50:10 +09:00","2022-09-29",0]
["DEV",1001,"첫번째 옆방","Room_1001",1,"Room_icon_2",0,2,"주얼",{"$f":"INDEX('NO_Table Parameter'!$G:$G,MATCH(I6,'NO_Table Parameter'!$H:$H,0))","v":4},1000,"Blueprint1_Room2","Blueprint1_Room2_icon","2023-03-02T05:50:10 +09:00","2022-09-29",0]
["DEV",1002,"새로운 옆방","Room_1002",1,"Room_icon_3",0,3,"주얼",{"$f":"INDEX('NO_Table Parameter'!$G:$G,MATCH(I7,'NO_Table Parameter'!$H:$H,0))","v":4},1000,"Blueprint1_Room3","Blueprint1_Room3_icon","2023-03-02T05:50:10 +09:00","2022-09-29",0]
["DEV",1003,"힐링 공간","Room_1003",1,"Room_icon_4",0,4,"주얼",{"$f":"INDEX('NO_Table Parameter'!$G:$G,MATCH(I8,'NO_Table Parameter'!$H:$H,0))","v":4},1000,"Blueprint1_Room4","Blueprint1_Room4_icon","2023-03-02T05:50:10 +09:00","2022-09-29",0]
["DEV",1004,"설렘 공간","Room_1004",1,"Room_icon_5",0,5,"주얼",{"$f":"INDEX('NO_Table Parameter'!$G:$G,MATCH(I9,'NO_Table Parameter'!$H:$H,0))","v":4},1000,"Blueprint1_Room5","Blueprint1_Room5_icon","2023-03-02T05:50:10 +09:00","2022-09-29",0]
["DEV",1005,"라스트 모퉁이 방","Room_1005",1,"Room_icon_6",0,6,"주얼",{"$f":"INDEX('NO_Table Parameter'!$G:$G,MATCH(I10,'NO_Table Parameter'!$H:$H,0))","v":4},1000,"Blueprint1_Room6","Blueprint1_Room6_icon","2023-03-02T05:50:10 +09:00","2022-09-29",0]
["DEV",1006,"소중한 첫번째 방","Room_1006",2,"Room_icon_1",1,1,"주얼",{"$f":"INDEX('NO_Table Parameter'!$G:$G,MATCH(I11,'NO_Table Parameter'!$H:$H,0))","v":4},1000,"Blueprint2_Room1","Blueprint2_Room1_icon","2023-03-02T05:50:10 +09:00","2022-09-29",0]
["DEV",1007,"첫번째 옆방","Room_1007",2,"Room_icon_2",0,2,"주얼",{"$f":"INDEX('NO_Table Parameter'!$G:$G,MATCH(I12,'NO_Table Parameter'!$H:$H,0))","v":4},1000,"Blueprint2_Room2","Blueprint2_Room2_icon","2023-03-02T05:50:10 +09:00","2022-09-29",0]
["DEV",1008,"새로운 옆방","Room_1008",2,"Room_icon_3",0,3,"주얼",{"$f":"INDEX('NO_Table Parameter'!$G:$G,MATCH(I13,'NO_Table Parameter'!$H:$H,0))","v":4},1000,"Blueprint2_Room3","Blueprint2_Room3_icon","2023-03-02T05:50:10 +09:00","2022-09-29",0]
["DEV",1009,"힐링 공간","Room_1009",2,"Room_icon_4",0,4,"주얼",{"$f":"INDEX('NO_Table Parameter'!$G:$G,MATCH(I14,'NO_Table Parameter'!$H:$H,0))","v":4},1000,"Blueprint2_Room4","Blueprint2_Room4_icon","2023-03-02T05:50:10 +09:00","2022-09-29",0]
["DEV",1010,"설렘 공간","Room_1010",2,"Room_icon_5",0,5,"주얼",{"$f":"INDEX('NO_Table Parameter'!$G:$G,MATCH(I15,'NO_Table Parameter'!$H:$H,0))","v":4},1000,"Blueprint2_Room5","Blueprint2_Room5_icon","2023-03-02T05:50:10 +09:00","2022-09-29",0]
{"$rows_left_out":110}
{"sheet":"Yard","index":3,"n_rows":15,"n_cols":13,"rows_kept":15,"cut":false,"hidden":false,"merged":[]}
["ServiceType","Key","FieldID","#YardName","YardName","IconID","IsBase","OpenSortIndex","OpenGroupID","ConsumeMatGroupID","OpenTime","#LiveDate","#UpdateVersion"]
["string","int","int","none","stringkey","string","bool","int","int","int","datetime","none","Client"]
["All","All","All","Client","Client","Client","Client","Client","All","All","All","Client","none"]
["서비스 타입","마당 ID","구역 ID","마당명","스트링 코드명","아이콘 ID","기본 마당 여부","오픈 순서","오픈 ID","소모 재료 그룹 ID","오픈 시간","출시 일자","업데이트 버전"]
["DEV",1000000,100,"마당: 3층 하우스 1","Yard_1000000","Yard_icon_1000000",1,1,null,null,"2023-03-02T05:50:10 +09:00","2022-09-29"]
["DEV",1000001,100,"마당: 3층 하우스 2","Yard_1000001","Yard_icon_1000000",0,2,null,null,"2023-03-02T05:50:10 +09:00","2022-09-29"]
["DEV",1000002,100,"마당: 3층 하우스 3","Yard_1000002","Yard_icon_1000000",0,3,null,null,"2023-03-02T05:50:10 +09:00","2022-09-29"]
["DEV",1000003,100,"마당: 3층 하우스 4","Yard_1000003","Yard_icon_1000000",0,4,null,null,"2023-03-02T05:50:10 +09:00","2022-09-29"]
["DEV",1000004,100,"마당: 3층 하우스 5","Yard_1000004","Yard_icon_1000000",0,5,null,null,"2023-03-02T05:50:10 +09:00","2022-09-29"]
["DEV",1000006,101,"마당: 1층이 넓은 하우스 1","Yard_1000006","Yard_icon_1000000",1,1,null,null,"2023-03-02T05:50:10 +09:00","2022-09-29"]
["DEV",1000007,101,"마당: 1층이 넓은 하우스 2","Yard_1000007","Yard_icon_1000000",0,2,22,1,"2023-03-02T05:50:10 +09:00","2022-09-29"]
["DEV",1000008,101,"마당: 1층이 넓은 하우스 3","Yard_1000008","Yard_icon_1000000",0,3,23,1,"2023-03-02T05:50:10 +09:00","2022-09-29"]
["DEV",1000009,101,"마당: 1층이 넓은 하우스 4","Yard_1000009","Yard_icon_1000000",0,4,24,1,"2023-03-02T05:50:10 +09:00","2022-09-29"]
["DEV",1000010,101,"마당: 1층이 넓은 하우스 5","Yard_1000010","Yard_icon_1000000",0,5,25,1,"2023-03-02T05:50:10 +09:00","2022-09-29"]
["DEV",1000011,101,"마당: 1층이 넓은 하우스 6","Yard_1000011","Yard_icon_1000000",0,6,26,1,"2023-03-02T05:50:10 +09:00","2022-09-29"]
{"$rows_left_out":1}
{"sheet":"Field","index":4,"n_rows":17,"n_cols":22,"rows_kept":17,"cut":false,"hidden":false,"merged":[]}
["ServiceType","Key","#FieldName","FieldName","IconID","FieldImage","IsSquare","IsHouse","BGMPrefabName","NightBGMPrefabName","CityID","IsShortcut","#IconTag","IconTag","FieldPrefabName","IsShortcutPopup","#EPlaceShortcutType","PlaceShortcutType","PlaceShortcutTypeString","OpenTime","#LiveDate","#UpdateVersion"]
["string","int","none","stringkey","none","string","bool","bool","string","string","int","bool","none","int","string","bool","none","EPlaceShortcutType","string","datetime","none","Client"]
["All","All","Client","Client","Client","Client","All","All","All","All","All","All","Client","Client","Client","Client","Client","Client","Client","All","Client","none"]
["서비스 타입","구역 ID","구역명","스트링 코드명","아이콘 ID","이미지명","광장 여부","하우스 여부","BGM 프리팹명","(밤) BGM 프리팹명 ","시티 ID","지도 숏컷 표시 여부","숏컷 아이콘 표시 ","숏컷 아이콘 표시","프리팹명","숏컷 팝업 출력 여부","숏컷 장소 종류","숏컷 장소 종류","숏컷 장소 스트링","오픈 시간","출시 일자","업데이트 버전"]
["DEV",100,"트로피칼 선 스테이트 하우스",{"$f":"INDEX([3]KOR_StringTable!$B:$B,MATCH(C5,[3]KOR_StringTable!$C:$C,0))","v":"Field_100"},"Field100_icon","Field100_image",0,1,"BGM_Vacation","BGM_Vacation_N",3,0,"없음",{"$f":"INDEX('NO_Table Parameter'!$J:$J,MATCH(M5,'NO_Table Parameter'!$K:$K,0))","v":0},"Field100",1,"마이 하우스",{"$f":"IFERROR(INDEX('NO_Table Parameter'!$M:$M,MATCH(Q5,'NO_Table Parameter'!$N:$N,0)),\"\")","v":1},{"$f":"IFERROR(INDEX([3]KOR_StringTable!$B:$B,MATCH(Q5,[3]KOR_StringTable!$C:$C,0)),\"\")","v":"My_House"},"2023-03-02T05:50:10 +09:00","2022-09-29"]
["DEV",101,"어반뷰 스테이트 하우스",{"$f":"INDEX([3]KOR_StringTable!$B:$B,MATCH(C6,[3]KOR_StringTable!$C:$C,0))","v":"Field_101"},"Field101_icon","Field101_image",0,1,"BGM_City","BGM_City_N",2,0,"없음",{"$f":"INDEX('NO_Table Parameter'!$J:$J,MATCH(M6,'NO_Table Parameter'!$K:$K,0))","v":0},"Field101",1,"마이 하우스",{"$f":"IFERROR(INDEX('NO_Table Parameter'!$M:$M,MATCH(Q6,'NO_Table Parameter'!$N:$N,0)),\"\")","v":1},{"$f":"IFERROR(INDEX([3]KOR_StringTable!$B:$B,MATCH(Q6,[3]KOR_StringTable!$C:$C,0)),\"\")","v":"My_House"},"2023-03-02T05:50:10 +09:00","2022-09-29"]
["DEV",102,"에버그린 스테이트 하우스",{"$f":"INDEX([3]KOR_StringTable!$B:$B,MATCH(C7,[3]KOR_StringTable!$C:$C,0))","v":"Field_103"},"Field102_icon","Field102_image",0,1,"BGM_Forest","BGM_Forest_N",1,0,"없음",{"$f":"INDEX('NO_Table Parameter'!$J:$J,MATCH(M7,'NO_Table Parameter'!$K:$K,0))","v":0},"Field102",1,"마이 하우스",{"$f":"IFERROR(INDEX('NO_Table Parameter'!$M:$M,MATCH(Q7,'NO_Table Parameter'!$N:$N,0)),\"\")","v":1},{"$f":"IFERROR(INDEX([3]KOR_StringTable!$B:$B,MATCH(Q7,[3]KOR_StringTable!$C:$C,0)),\"\")","v":"My_House"},"2023-03-02T05:50:10 +09:00","2022-09-29"]
["DEV",103,"퀸즈 팰리스 스테이트 하우스",{"$f":"INDEX([3]KOR_StringTable!$B:$B,MATCH(C8,[3]KOR_StringTable!$C:$C,0))","v":"Field_104"},"Field103_icon","Field103_image",0,1,"BGM_European","BGM_European_N",4,0,"없음",{"$f":"INDEX('NO_Table Parameter'!$J:$J,MATCH(M8,'NO_Table Parameter'!$K:$K,0))","v":0},"Field103",1,"마이 하우스",{"$f":"IFERROR(INDEX('NO_Table Parameter'!$M:$M,MATCH(Q8,'NO_Table Parameter'!$N:$N,0)),\"\")","v":1},{"$f":"IFERROR(INDEX([3]KOR_StringTable!$B:$B,MATCH(Q8,[3]KOR_StringTable!$C:$C,0)),\"\")","v":"My_House"},"2023-03-02T05:50:10 +09:00","2022-09-29"]
["DEV",104,"그린팜",{"$f":"INDEX([3]KOR_StringTable!$B:$B,MATCH(C9,[3]KOR_StringTable!$C:$C,0))","v":"Field_105"},"Field104_icon","Field104_image",0,0,"BGM_European",null,null,0,"없음",{"$f":"INDEX('NO_Table Parameter'!$J:$J,MATCH(M9,'NO_Table Parameter'!$K:$K,0))","v":0},"GreenHouseField104",0,null,{"$f":"IFERROR(INDEX('NO_Table Parameter'!$M:$M,MATCH(Q9,'NO_Table Parameter'!$N:$N,0)),\"\")","v":""},{"$f":"IFERROR(INDEX([3]KOR_StringTable!$B:$B,MATCH(Q9,[3]KOR_StringTable!$C:$C,0)),\"\")","v":""},"2023-03-02T05:50:10 +09:00","2022-09-29"]
["DEV",105,"센트럴 타운",{"$f":"INDEX([3]KOR_StringTable!$B:$B,MATCH(C10,[3]KOR_StringTable!$C:$C,0))","v":"CentralTown"},"Field105_icon","Field105_image",1,0,"BGM_CentralTown","BGM_CentralTown_N",3,0,"없음",{"$f":"INDEX('NO_Table Parameter'!$J:$J,MATCH(M10,'NO_Table Parameter'!$K:$K,0))","v":0},"MissionHouseLobbyField105",1,"만남의 공간",{"$f":"IFERROR(INDEX('NO_Table Parameter'!$M:$M,MATCH(Q10,'NO_Table Parameter'!$N:$N,0)),\"\")","v":3},{"$f":"IFERROR(INDEX([3]KOR_StringTable!$B:$B,MATCH(Q10,[3]KOR_StringTable!$C:$C,0)),\"\")","v":"Plaza"},"2023-03-02T05:50:10 +09:00","2022-09-29"]
["DEV",106,"에버그린 랜드마크",{"$f":"INDEX([3]KOR_StringTable!$B:$B,MATCH(C11,[3]KOR_StringTable!$C:$C,0))","v":"Field_106"},"Field106_icon","Field106_image",1,0,"BGM_EverGreen","BGM_EverGreen_N",2,0,"없음",{"$f":"INDEX('NO_Table Parameter'!$J:$J,MATCH(M11,'NO_Table Parameter'!$K:$K,0))","v":0},"LandMark106",1,"만남의 공간",{"$f":"IFERROR(INDEX('NO_Table Parameter'!$M:$M,MATCH(Q11,'NO_Table Parameter'!$N:$N,0)),\"\")","v":3},{"$f":"IFERROR(INDEX([3]KOR_StringTable!$B:$B,MATCH(Q11,[3]KOR_StringTable!$C:$C,0)),\"\")","v":"Plaza"},"2023-03-02T05:50:10 +09:00","2022-09-29"]
["DEV",107,"퀸즈 팰리스 랜드마크",{"$f":"INDEX([3]KOR_StringTable!$B:$B,MATCH(C12,[3]KOR_StringTable!$C:$C,0))","v":"Field_107"},"Field107_icon","Field107_image",1,0,"BGM_QueenPalace","BGM_QueenPalace_N",1,0,"없음",{"$f":"INDEX('NO_Table Parameter'!$J:$J,MATCH(M12,'NO_Table Parameter'!$K:$K,0))","v":0},"QueensPalaceLandMark001",0,null,{"$f":"IFERROR(INDEX('NO_Table Parameter'!$M:$M,MATCH(Q12,'NO_Table Parameter'!$N:$N,0)),\"\")","v":""},{"$f":"IFERROR(INDEX([3]KOR_StringTable!$B:$B,MATCH(Q12,[3]KOR_StringTable!$C:$C,0)),\"\")","v":""},"2023-03-02T05:50:10 +09:00","2022-09-29"]
["DEV",108,"패션 스트릿",{"$f":"INDEX([3]KOR_StringTable!$B:$B,MATCH(C13,[3]KOR_StringTable!$C:$C,0))","v":"Zone_104"},"Field108_icon","Field108_image",1,0,"BGM_FashionStreet","BGM_FashionStreet_N",4,0,"없음",{"$f":"INDEX('NO_Table Parameter'!$J:$J,MATCH(M13,'NO_Table Parameter'!$K:$K,0))","v":0},"PashionStreet001",1,"만남의 공간",{"$f":"IFERROR(INDEX('NO_Table Parameter'!$M:$M,MATCH(Q13,'NO_Table Parameter'!$N:$N,0)),\"\")","v":3},{"$f":"IFERROR(INDEX([3]KOR_StringTable!$B:$B,MATCH(Q13,[3]KOR_StringTable!$C:$C,0)),\"\")","v":"Plaza"},"2023-03-02T05:50:10 +09:00","2022-09-29"]
["DEV",109,"그리너리 시티 빌리지",{"$f":"INDEX([3]KOR_StringTable!$B:$B,MATCH(C14,[3]KOR_StringTable!$C:$C,0))","v":"Field_109"},"Field109_icon","Field109_image",1,0,null,null,1,0,"없음",{"$f":"INDEX('NO_Table Parameter'!$J:$J,MATCH(M14,'NO_Table Parameter'!$K:$K,0))","v":0},"Village000001",1,"마이 빌리지",{"$f":"IFERROR(INDEX('NO_Table Parameter'!$M:$M,MATCH(Q14,'NO_Table Parameter'!$N:$N,0)),\"\")","v":2},{"$f":"IFERROR(INDEX([3]KOR_StringTable!$B:$B,MATCH(Q14,[3]KOR_StringTable!$C:$C,0)),\"\")","v":"My_Village"},"2023-03-02T05:50:10 +09:00","2022-09-29"]
["DEV",110,"어반뷰 시티 빌리지",{"$f":"INDEX([3]KOR_StringTable!$B:$B,MATCH(C15,[3]KOR_StringTable!$C:$C,0))","v":"Field_110"},"Field110_icon","Field110_image",1,0,null,null,2,0,"없음",{"$f":"INDEX('NO_Table Parameter'!$J:$J,MATCH(M15,'NO_Table Parameter'!$K:$K,0))","v":0},"Village000002",1,"마이 빌리지",{"$f":"IFERROR(INDEX('NO_Table Parameter'!$M:$M,MATCH(Q15,'NO_Table Parameter'!$N:$N,0)),\"\")","v":2},{"$f":"IFERROR(INDEX([3]KOR_StringTable!$B:$B,MATCH(Q15,[3]KOR_StringTable!$C:$C,0)),\"\")","v":"My_Village"},"2023-03-02T05:50:10 +09:00","2022-09-29"]
{"$rows_left_out":3}
{"sheet":"SaveRoom","index":5,"n_rows":20,"n_cols":12,"rows_kept":20,"cut":false,"hidden":false,"merged":[]}
["ServiceType","Key","#FieldName","FieldID","Sortindex","#BuyPriceType","BuyPriceType","BuyPriceValue","IsShow","OpenTime","#LiveDate","#UpdateVersion"]
["string","int","none","int","int","none","ERewardType","int","int","datetime","none","none"]
["All","All","Client","All","Client","All","All","All","All","All","Client","Client"]
["서비스 타입","저장룸 ID","구역명","구역 ID","순서","구매재화종류","구매재화종류","재화 값","표시 여부","오픈 시간","출시 일자","업데이트 버전"]
["DEV",1000000,"에버그린 스테이트 하우스",{"$f":"IF(ISTEXT(C5),INDEX(Field!$B$5:$B$1048576,MATCH(SaveRoom!C5,Field!$C$5:$C$1048576,0)),\"\")","v":102},1,"골드",{"$f":"INDEX('NO_Table Parameter'!$G:$G,MATCH(F5,'NO_Table Parameter'!$H:$H,0))","v":1},1000000,1,"2023-03-02T05:50:10 +09:00","2022-11-10",0]
["DEV",1000001,"에버그린 스테이트 하우스",{"$f":"IF(ISTEXT(C6),INDEX(Field!$B$5:$B$1048576,MATCH(SaveRoom!C6,Field!$C$5:$C$1048576,0)),\"\")","v":102},2,"주얼",{"$f":"INDEX('NO_Table Parameter'!$G:$G,MATCH(F6,'NO_Table Parameter'!$H:$H,0))","v":4},100,1,"2023-03-02T05:50:10 +09:00","2022-11-10",0]
["DEV",1000002,"에버그린 스테이트 하우스",{"$f":"IF(ISTEXT(C7),INDEX(Field!$B$5:$B$1048576,MATCH(SaveRoom!C7,Field!$C$5:$C$1048576,0)),\"\")","v":102},3,"주얼",{"$f":"INDEX('NO_Table Parameter'!$G:$G,MATCH(F7,'NO_Table Parameter'!$H:$H,0))","v":4},100,1,"2023-03-02T05:50:10 +09:00","2022-11-10",0]
["DEV",1000003,"에버그린 스테이트 하우스",{"$f":"IF(ISTEXT(C8),INDEX(Field!$B$5:$B$1048576,MATCH(SaveRoom!C8,Field!$C$5:$C$1048576,0)),\"\")","v":102},4,"주얼",{"$f":"INDEX('NO_Table Parameter'!$G:$G,MATCH(F8,'NO_Table Parameter'!$H:$H,0))","v":4},100,1,"2023-03-02T05:50:10 +09:00","2022-11-10",0]
["DEV",1000004,"어반뷰 스테이트 하우스",{"$f":"IF(ISTEXT(C9),INDEX(Field!$B$5:$B$1048576,MATCH(SaveRoom!C9,Field!$C$5:$C$1048576,0)),\"\")","v":101},1,"골드",{"$f":"INDEX('NO_Table Parameter'!$G:$G,MATCH(F9,'NO_Table Parameter'!$H:$H,0))","v":1},1000000,1,"2023-03-02T05:50:10 +09:00","2022-11-10",0]
["DEV",1000005,"어반뷰 스테이트 하우스",{"$f":"IF(ISTEXT(C10),INDEX(Field!$B$5:$B$1048576,MATCH(SaveRoom!C10,Field!$C$5:$C$1048576,0)),\"\")","v":101},2,"주얼",{"$f":"INDEX('NO_Table Parameter'!$G:$G,MATCH(F10,'NO_Table Parameter'!$H:$H,0))","v":4},100,1,"2023-03-02T05:50:10 +09:00","2022-11-10",0]
["DEV",1000006,"어반뷰 스테이트 하우스",{"$f":"IF(ISTEXT(C11),INDEX(Field!$B$5:$B$1048576,MATCH(SaveRoom!C11,Field!$C$5:$C$1048576,0)),\"\")","v":101},3,"주얼",{"$f":"INDEX('NO_Table Parameter'!$G:$G,MATCH(F11,'NO_Table Parameter'!$H:$H,0))","v":4},100,1,"2023-03-02T05:50:10 +09:00","2022-11-10",0]
["DEV",1000007,"어반뷰 스테이트 하우스",{"$f":"IF(ISTEXT(C12),INDEX(Field!$B$5:$B$1048576,MATCH(SaveRoom!C12,Field!$C$5:$C$1048576,0)),\"\")","v":101},4,"주얼",{"$f":"INDEX('NO_Table Parameter'!$G:$G,MATCH(F12,'NO_Table Parameter'!$H:$H,0))","v":4},100,1,"2023-03-02T05:50:10 +09:00","2022-11-10",0]
["DEV",1000008,"퀸즈 팰리스 스테이트 하우스",{"$f":"IF(ISTEXT(C13),INDEX(Field!$B$5:$B$1048576,MATCH(SaveRoom!C13,Field!$C$5:$C$1048576,0)),\"\")","v":103},1,"골드",{"$f":"INDEX('NO_Table Parameter'!$G:$G,MATCH(F13,'NO_Table Parameter'!$H:$H,0))","v":1},1000000,1,"2023-03-02T05:50:10 +09:00","2022-11-10",0]
["DEV",1000009,"퀸즈 팰리스 스테이트 하우스",{"$f":"IF(ISTEXT(C14),INDEX(Field!$B$5:$B$1048576,MATCH(SaveRoom!C14,Field!$C$5:$C$1048576,0)),\"\")","v":103},2,"주얼",{"$f":"INDEX('NO_Table Parameter'!$G:$G,MATCH(F14,'NO_Table Parameter'!$H:$H,0))","v":4},100,1,"2023-03-02T05:50:10 +09:00","2022-11-10",0]
["DEV",1000010,"퀸즈 팰리스 스테이트 하우스",{"$f":"IF(ISTEXT(C15),INDEX(Field!$B$5:$B$1048576,MATCH(SaveRoom!C15,Field!$C$5:$C$1048576,0)),\"\")","v":103},3,"주얼",{"$f":"INDEX('NO_Table Parameter'!$G:$G,MATCH(F15,'NO_Table Parameter'!$H:$H,0))","v":4},100,1,"2023-03-02T05:50:10 +09:00","2022-11-10",0]
{"$rows_left_out":5}